BDBM50247755 2-[(3-(4-Methoxyphenyl)-5'-furyl-2'-pyrazoline-1-yl]-3-methyl-4(3H)-quinazolinone::CHEMBL460730
SMILES: COc1ccc(cc1)C1=NN(C(C1)c1ccco1)c1nc2ccccc2c(=O)n1C
InChI Key: InChIKey=RDFLQJHKCILDSM-UHFFFAOYSA-N
Data: 2 KI  2 IC50
Activity Spreadsheet -- Enzyme Inhibition Constant Data from BindingDB
Found 4 hits for monomerid = 50247755
Trg + Lig
Ki
nM
ΔG°
kcal/mole
IC50
nM
Kd
nM
EC50/IC50
nM
koff
s-1
kon
M-1s-1
pHTemp
°C
Monoamine Oxidase Type B (MAO-B)
(Rattus norvegicus (rat))
BDBM50247755
(2-[(3-(4-Methoxyphenyl)-5'-furyl-2'-pyrazoline-1-y...)
Show SMILES COc1ccc(cc1)C1=NN(C(C1)c1ccco1)c1nc2ccccc2c(=O)n1C |t:9|
Show InChI InChI=1S/C23H20N4O3/c1-26-22(28)17-6-3-4-7-18(17)24-23(26)27-20(21-8-5-13-30-21)14-19(25-27)15-9-11-16(29-2)12-10-15/h3-13,20H,14H2,1-2H3
1.48E+3n/an/an/an/an/an/an/an/a
Hacettepe University
Curated by ChEMBL
Assay Description
Inhibition of MAO-B in rat liver homogenate after 60 mins by Lineweaver-Burk plot
Bioorg Med Chem 17: 675-89 (2009)
Article DOI: 10.1016/j.bmc.2008.11.068
BindingDB Entry DOI: 10.7270/Q2BG2NWT
Monoamine oxidase
(Rattus norvegicus (rat))
BDBM50247755
(2-[(3-(4-Methoxyphenyl)-5'-furyl-2'-pyrazoline-1-y...)
Show SMILES COc1ccc(cc1)C1=NN(C(C1)c1ccco1)c1nc2ccccc2c(=O)n1C |t:9|
Show InChI InChI=1S/C23H20N4O3/c1-26-22(28)17-6-3-4-7-18(17)24-23(26)27-20(21-8-5-13-30-21)14-19(25-27)15-9-11-16(29-2)12-10-15/h3-13,20H,14H2,1-2H3
6.80E+3n/an/an/an/an/an/an/an/a
Hacettepe University
Curated by ChEMBL
Assay Description
Inhibition of MAO-A in rat liver homogenate after 60 mins by Lineweaver-Burk plot
Bioorg Med Chem 17: 675-89 (2009)
Article DOI: 10.1016/j.bmc.2008.11.068
BindingDB Entry DOI: 10.7270/Q2BG2NWT
Monoamine Oxidase Type B (MAO-B)
(Rattus norvegicus (rat))
BDBM50247755
(2-[(3-(4-Methoxyphenyl)-5'-furyl-2'-pyrazoline-1-y...)
Show SMILES COc1ccc(cc1)C1=NN(C(C1)c1ccco1)c1nc2ccccc2c(=O)n1C |t:9|
Show InChI InChI=1S/C23H20N4O3/c1-26-22(28)17-6-3-4-7-18(17)24-23(26)27-20(21-8-5-13-30-21)14-19(25-27)15-9-11-16(29-2)12-10-15/h3-13,20H,14H2,1-2H3
n/an/a 2.03E+3n/an/an/an/an/an/a
Hacettepe University
Curated by ChEMBL
Assay Description
Inhibition of MAO-B in rat liver homogenate after 60 mins by residual activity plot
Bioorg Med Chem 17: 675-89 (2009)
Article DOI: 10.1016/j.bmc.2008.11.068
BindingDB Entry DOI: 10.7270/Q2BG2NWT
Monoamine oxidase
(Rattus norvegicus (rat))
BDBM50247755
(2-[(3-(4-Methoxyphenyl)-5'-furyl-2'-pyrazoline-1-y...)
Show SMILES COc1ccc(cc1)C1=NN(C(C1)c1ccco1)c1nc2ccccc2c(=O)n1C |t:9|
Show InChI InChI=1S/C23H20N4O3/c1-26-22(28)17-6-3-4-7-18(17)24-23(26)27-20(21-8-5-13-30-21)14-19(25-27)15-9-11-16(29-2)12-10-15/h3-13,20H,14H2,1-2H3
n/an/a 4.18E+5n/an/an/an/an/an/a
Hacettepe University
Curated by ChEMBL
Assay Description
Inhibition of MAO-A in rat liver homogenate after 60 mins by residual activity plot
Bioorg Med Chem 17: 675-89 (2009)
Article DOI: 10.1016/j.bmc.2008.11.068
BindingDB Entry DOI: 10.7270/Q2BG2NWT