BDBM50247837 5-Chloro-2-pentylisothiazol-3(2H)-one::CHEMBL489115
SMILES: CCCCCn1sc(Cl)cc1=O
InChI Key: InChIKey=IBVIJMZIFISCOI-UHFFFAOYSA-N
Data: 1 IC50
Activity Spreadsheet -- Enzyme Inhibition Constant Data from BindingDB
Found 1 hit for monomerid = 50247837
Trg + Lig
Ki
nM
ΔG°
kcal/mole
IC50
nM
Kd
nM
EC50/IC50
nM
koff
s-1
kon
M-1s-1
pHTemp
°C
Histone acetyltransferase PCAF
(Homo sapiens (Human))
BDBM50247837
(5-Chloro-2-pentylisothiazol-3(2H)-one | CHEMBL4891...)
Show SMILES CCCCCn1sc(Cl)cc1=O
Show InChI InChI=1S/C8H12ClNOS/c1-2-3-4-5-10-8(11)6-7(9)12-10/h6H,2-5H2,1H3
NCI pathway
Reactome pathway
n/an/a 2.90E+3n/an/an/an/an/an/a
University of Groningen
Curated by ChEMBL
Assay Description
Inhibition of human recombinant HAT PCAF
Bioorg Med Chem 17: 460-6 (2009)
Article DOI: 10.1016/j.bmc.2008.12.008
BindingDB Entry DOI: 10.7270/Q2BC3ZDM