BDBM50247996 5-(2-(trifluoromethyl)benzyl)-5,6,7,8,9,10-hexahydrocyclohepta[b]indole-4-carboxylic acid::CHEMBL460750
SMILES: OC(=O)c1cccc2c3CCCCCc3n(Cc3ccccc3C(F)(F)F)c12
InChI Key: InChIKey=XBEYMPQYMQFLBW-UHFFFAOYSA-N
Data: 3 IC50
Activity Spreadsheet -- Enzyme Inhibition Constant Data from BindingDB
Found 3 hits for monomerid = 50247996
Trg + Lig
Ki
nM
ΔG°
kcal/mole
IC50
nM
Kd
nM
EC50/IC50
nM
koff
s-1
kon
M-1s-1
pHTemp
°C
Fatty acid-binding protein 4 (FABP4)
(Homo sapiens (Human))
BDBM50247996
(5-(2-(trifluoromethyl)benzyl)-5,6,7,8,9,10-hexahyd...)
Show SMILES OC(=O)c1cccc2c3CCCCCc3n(Cc3ccccc3C(F)(F)F)c12
Show InChI InChI=1S/C22H20F3NO2/c23-22(24,25)18-11-5-4-7-14(18)13-26-19-12-3-1-2-8-15(19)16-9-6-10-17(20(16)26)21(27)28/h4-7,9-11H,1-3,8,12-13H2,(H,27,28)
n/an/a 650n/an/an/an/an/an/a
Biovitrum AB
Curated by ChEMBL
Assay Description
Inhibition of human A-FABP by fluorescence polarization assay
Bioorg Med Chem Lett 19: 1745-8 (2009)
Article DOI: 10.1016/j.bmcl.2009.01.084
BindingDB Entry DOI: 10.7270/Q2TX3F8G
Fatty acid binding protein muscle
(Homo sapiens (Human))
BDBM50247996
(5-(2-(trifluoromethyl)benzyl)-5,6,7,8,9,10-hexahyd...)
Show SMILES OC(=O)c1cccc2c3CCCCCc3n(Cc3ccccc3C(F)(F)F)c12
Show InChI InChI=1S/C22H20F3NO2/c23-22(24,25)18-11-5-4-7-14(18)13-26-19-12-3-1-2-8-15(19)16-9-6-10-17(20(16)26)21(27)28/h4-7,9-11H,1-3,8,12-13H2,(H,27,28)
n/an/a 34n/an/an/an/an/an/a
Biovitrum AB
Curated by ChEMBL
Assay Description
Inhibition of human H-FABP by scintillation proximity assay
Bioorg Med Chem Lett 19: 1745-8 (2009)
Article DOI: 10.1016/j.bmcl.2009.01.084
BindingDB Entry DOI: 10.7270/Q2TX3F8G
Fatty acid-binding protein 4 (FABP4)
(Homo sapiens (Human))
BDBM50247996
(5-(2-(trifluoromethyl)benzyl)-5,6,7,8,9,10-hexahyd...)
Show SMILES OC(=O)c1cccc2c3CCCCCc3n(Cc3ccccc3C(F)(F)F)c12
Show InChI InChI=1S/C22H20F3NO2/c23-22(24,25)18-11-5-4-7-14(18)13-26-19-12-3-1-2-8-15(19)16-9-6-10-17(20(16)26)21(27)28/h4-7,9-11H,1-3,8,12-13H2,(H,27,28)
n/an/a 49n/an/an/an/an/an/a
Biovitrum AB
Curated by ChEMBL
Assay Description
Inhibition of human A-FABP by scintillation proximity assay
Bioorg Med Chem Lett 19: 1745-8 (2009)
Article DOI: 10.1016/j.bmcl.2009.01.084
BindingDB Entry DOI: 10.7270/Q2TX3F8G