BDBM50248182 CHEMBL475351::N-(4-(benzo[d]thiazol-2-yl)-3-methoxyphenyl)-2-methoxy-9H-purin-6-amine
SMILES: COc1nc(Nc2ccc(-c3nc4ccccc4s3)c(OC)c2)c2cc[nH]c2n1
InChI Key: InChIKey=AOUMXCXOJGAKLX-UHFFFAOYSA-N
Data: 10 IC50
Activity Spreadsheet -- Enzyme Inhibition Constant Data from BindingDB
Found 10 hits for monomerid = 50248182
Trg + Lig
Ki
nM
ΔG°
kcal/mole
IC50
nM
Kd
nM
EC50/IC50
nM
koff
s-1
kon
M-1s-1
pHTemp
°C
Focal adhesion kinase 1/vascular endothelial growth factor receptor 3
(Homo sapiens (Human))
BDBM50248182
(CHEMBL475351 | N-(4-(benzo[d]thiazol-2-yl)-3-metho...)
Show SMILES COc1nc(Nc2ccc(-c3nc4ccccc4s3)c(OC)c2)c2cc[nH]c2n1
Show InChI InChI=1S/C21H17N5O2S/c1-27-16-11-12(23-19-14-9-10-22-18(14)25-21(26-19)28-2)7-8-13(16)20-24-15-5-3-4-6-17(15)29-20/h3-11H,1-2H3,(H2,22,23,25,26)
n/an/a 7.70E+3n/an/an/an/an/an/a
4SC AG
Curated by ChEMBL
Assay Description
Inhibition of VEGFR3 by virtual HTS assay
Bioorg Med Chem Lett 19: 1349-56 (2009)
Article DOI: 10.1016/j.bmcl.2009.01.054
BindingDB Entry DOI: 10.7270/Q2736QS3
Insulin receptor
(Homo sapiens (Human))
BDBM50248182
(CHEMBL475351 | N-(4-(benzo[d]thiazol-2-yl)-3-metho...)
Show SMILES COc1nc(Nc2ccc(-c3nc4ccccc4s3)c(OC)c2)c2cc[nH]c2n1
Show InChI InChI=1S/C21H17N5O2S/c1-27-16-11-12(23-19-14-9-10-22-18(14)25-21(26-19)28-2)7-8-13(16)20-24-15-5-3-4-6-17(15)29-20/h3-11H,1-2H3,(H2,22,23,25,26)
n/an/a>1.00E+4n/an/an/an/an/an/a
4SC AG
Curated by ChEMBL
Assay Description
Inhibition of insulin receptor by virtual HTS assay
Bioorg Med Chem Lett 19: 1349-56 (2009)
Article DOI: 10.1016/j.bmcl.2009.01.054
BindingDB Entry DOI: 10.7270/Q2736QS3
Aurora kinase B
(Homo sapiens (Human))
BDBM50248182
(CHEMBL475351 | N-(4-(benzo[d]thiazol-2-yl)-3-metho...)
Show SMILES COc1nc(Nc2ccc(-c3nc4ccccc4s3)c(OC)c2)c2cc[nH]c2n1
Show InChI InChI=1S/C21H17N5O2S/c1-27-16-11-12(23-19-14-9-10-22-18(14)25-21(26-19)28-2)7-8-13(16)20-24-15-5-3-4-6-17(15)29-20/h3-11H,1-2H3,(H2,22,23,25,26)
Reactome pathway
n/an/a>1.00E+4n/an/an/an/an/an/a
4SC AG
Curated by ChEMBL
Assay Description
Inhibition of Aurora B by virtual HTS assay
Bioorg Med Chem Lett 19: 1349-56 (2009)
Article DOI: 10.1016/j.bmcl.2009.01.054
BindingDB Entry DOI: 10.7270/Q2736QS3
Vascular endothelial growth factor receptor 2
(Homo sapiens (Human))
BDBM50248182
(CHEMBL475351 | N-(4-(benzo[d]thiazol-2-yl)-3-metho...)
Show SMILES COc1nc(Nc2ccc(-c3nc4ccccc4s3)c(OC)c2)c2cc[nH]c2n1
Show InChI InChI=1S/C21H17N5O2S/c1-27-16-11-12(23-19-14-9-10-22-18(14)25-21(26-19)28-2)7-8-13(16)20-24-15-5-3-4-6-17(15)29-20/h3-11H,1-2H3,(H2,22,23,25,26)
NCI pathway
Reactome pathway
n/an/a 960n/an/an/an/an/an/a
4SC AG
Curated by ChEMBL
Assay Description
Inhibition of VEGFR2 by virtual HTS assay
Bioorg Med Chem Lett 19: 1349-56 (2009)
Article DOI: 10.1016/j.bmcl.2009.01.054
BindingDB Entry DOI: 10.7270/Q2736QS3
Receptor tyrosine-protein kinase erbB-2
(Homo sapiens (Human))
BDBM50248182
(CHEMBL475351 | N-(4-(benzo[d]thiazol-2-yl)-3-metho...)
Show SMILES COc1nc(Nc2ccc(-c3nc4ccccc4s3)c(OC)c2)c2cc[nH]c2n1
Show InChI InChI=1S/C21H17N5O2S/c1-27-16-11-12(23-19-14-9-10-22-18(14)25-21(26-19)28-2)7-8-13(16)20-24-15-5-3-4-6-17(15)29-20/h3-11H,1-2H3,(H2,22,23,25,26)
n/an/a>1.00E+4n/an/an/an/an/an/a
4SC AG
Curated by ChEMBL
Assay Description
Inhibition of ErbB2 by virtual HTS assay
Bioorg Med Chem Lett 19: 1349-56 (2009)
Article DOI: 10.1016/j.bmcl.2009.01.054
BindingDB Entry DOI: 10.7270/Q2736QS3
Insulin-like growth factor I receptor
(Homo sapiens (Human))
BDBM50248182
(CHEMBL475351 | N-(4-(benzo[d]thiazol-2-yl)-3-metho...)
Show SMILES COc1nc(Nc2ccc(-c3nc4ccccc4s3)c(OC)c2)c2cc[nH]c2n1
Show InChI InChI=1S/C21H17N5O2S/c1-27-16-11-12(23-19-14-9-10-22-18(14)25-21(26-19)28-2)7-8-13(16)20-24-15-5-3-4-6-17(15)29-20/h3-11H,1-2H3,(H2,22,23,25,26)
Reactome pathway
n/an/a 2.90E+3n/an/an/an/an/an/a
4SC AG
Curated by ChEMBL
Assay Description
Inhibition of IGF1R by virtual HTS assay
Bioorg Med Chem Lett 19: 1349-56 (2009)
Article DOI: 10.1016/j.bmcl.2009.01.054
BindingDB Entry DOI: 10.7270/Q2736QS3
Angiopoietin-1 receptor
(Homo sapiens (Human))
BDBM50248182
(CHEMBL475351 | N-(4-(benzo[d]thiazol-2-yl)-3-metho...)
Show SMILES COc1nc(Nc2ccc(-c3nc4ccccc4s3)c(OC)c2)c2cc[nH]c2n1
Show InChI InChI=1S/C21H17N5O2S/c1-27-16-11-12(23-19-14-9-10-22-18(14)25-21(26-19)28-2)7-8-13(16)20-24-15-5-3-4-6-17(15)29-20/h3-11H,1-2H3,(H2,22,23,25,26)
n/an/a 2.50E+3n/an/an/an/an/an/a
4SC AG
Curated by ChEMBL
Assay Description
Inhibition of TIE2 by virtual HTS assay
Bioorg Med Chem Lett 19: 1349-56 (2009)
Article DOI: 10.1016/j.bmcl.2009.01.054
BindingDB Entry DOI: 10.7270/Q2736QS3
Proto-oncogene tyrosine-protein kinase Src
(Homo sapiens (Human))
BDBM50248182
(CHEMBL475351 | N-(4-(benzo[d]thiazol-2-yl)-3-metho...)
Show SMILES COc1nc(Nc2ccc(-c3nc4ccccc4s3)c(OC)c2)c2cc[nH]c2n1
Show InChI InChI=1S/C21H17N5O2S/c1-27-16-11-12(23-19-14-9-10-22-18(14)25-21(26-19)28-2)7-8-13(16)20-24-15-5-3-4-6-17(15)29-20/h3-11H,1-2H3,(H2,22,23,25,26)
n/an/a 2.10E+3n/an/an/an/an/an/a
4SC AG
Curated by ChEMBL
Assay Description
Inhibition of Src by virtual HTS assay
Bioorg Med Chem Lett 19: 1349-56 (2009)
Article DOI: 10.1016/j.bmcl.2009.01.054
BindingDB Entry DOI: 10.7270/Q2736QS3
Aurora kinase A
(Homo sapiens (Human))
BDBM50248182
(CHEMBL475351 | N-(4-(benzo[d]thiazol-2-yl)-3-metho...)
Show SMILES COc1nc(Nc2ccc(-c3nc4ccccc4s3)c(OC)c2)c2cc[nH]c2n1
Show InChI InChI=1S/C21H17N5O2S/c1-27-16-11-12(23-19-14-9-10-22-18(14)25-21(26-19)28-2)7-8-13(16)20-24-15-5-3-4-6-17(15)29-20/h3-11H,1-2H3,(H2,22,23,25,26)
NCI pathway
Reactome pathway
n/an/a>1.00E+4n/an/an/an/an/an/a
4SC AG
Curated by ChEMBL
Assay Description
Inhibition of Aurora A by virtual HTS assay
Bioorg Med Chem Lett 19: 1349-56 (2009)
Article DOI: 10.1016/j.bmcl.2009.01.054
BindingDB Entry DOI: 10.7270/Q2736QS3
Epidermal growth factor receptor
(Homo sapiens (Human))
BDBM50248182
(CHEMBL475351 | N-(4-(benzo[d]thiazol-2-yl)-3-metho...)
Show SMILES COc1nc(Nc2ccc(-c3nc4ccccc4s3)c(OC)c2)c2cc[nH]c2n1
Show InChI InChI=1S/C21H17N5O2S/c1-27-16-11-12(23-19-14-9-10-22-18(14)25-21(26-19)28-2)7-8-13(16)20-24-15-5-3-4-6-17(15)29-20/h3-11H,1-2H3,(H2,22,23,25,26)
n/an/a 5.10E+3n/an/an/an/an/an/a
4SC AG
Curated by ChEMBL
Assay Description
Inhibition of EGFR by virtual HTS assay
Bioorg Med Chem Lett 19: 1349-56 (2009)
Article DOI: 10.1016/j.bmcl.2009.01.054
BindingDB Entry DOI: 10.7270/Q2736QS3