BDBM50248256 3-(1-(4-(dimethylamino)butyl)-2-phenethyl-1H-benzo[d]imidazol-5-yl)-N-hydroxyacrylamide::CHEMBL474349::US10201527, Compound 57::US10736881, Compound 57
SMILES: CN(C)CCCCn1c(CCc2ccccc2)nc2cc(\C=C\C(=O)NO)ccc12
InChI Key: InChIKey=AAZSJWCWXIAUHW-NTCAYCPXSA-N
Data: 3 IC50
Activity Spreadsheet -- Enzyme Inhibition Constant Data from BindingDB
Found 3 hits for monomerid = 50248256
Trg + Lig
Ki
nM
ΔG°
kcal/mole
IC50
nM
Kd
nM
EC50/IC50
nM
koff
s-1
kon
M-1s-1
pHTemp
°C
Histone deacetylase 1
(Homo sapiens (Human))
BDBM50248256
(3-(1-(4-(dimethylamino)butyl)-2-phenethyl-1H-benzo...)
Show SMILES CN(C)CCCCn1c(CCc2ccccc2)nc2cc(\C=C\C(=O)NO)ccc12
Show InChI InChI=1S/C24H30N4O2/c1-27(2)16-6-7-17-28-22-13-10-20(12-15-24(29)26-30)18-21(22)25-23(28)14-11-19-8-4-3-5-9-19/h3-5,8-10,12-13,15,18,30H,6-7,11,14,16-17H2,1-2H3,(H,26,29)/b15-12+
NCI pathway
Reactome pathway
n/an/a 160n/an/an/an/an/an/a
S *BIO Pte Ltd
Curated by ChEMBL
Assay Description
Inhibition of recombinant HDAC1 by fluorimetric assay
Bioorg Med Chem Lett 19: 1403-8 (2009)
Article DOI: 10.1016/j.bmcl.2009.01.041
BindingDB Entry DOI: 10.7270/Q2FT8KX3
Cereblon/Histone deacetylase 1
(Homo sapiens (Human))
BDBM50248256
(3-(1-(4-(dimethylamino)butyl)-2-phenethyl-1H-benzo...)
Show SMILES CN(C)CCCCn1c(CCc2ccccc2)nc2cc(\C=C\C(=O)NO)ccc12
Show InChI InChI=1S/C24H30N4O2/c1-27(2)16-6-7-17-28-22-13-10-20(12-15-24(29)26-30)18-21(22)25-23(28)14-11-19-8-4-3-5-9-19/h3-5,8-10,12-13,15,18,30H,6-7,11,14,16-17H2,1-2H3,(H,26,29)/b15-12+
NCI pathway
Reactome pathway
US Patent
n/an/a 153n/an/an/an/an/an/a
MEI Pharma, Inc.
US Patent
Assay Description
The assay has been carried out in 96 well format and the BIOMOL fluorescent-based HDAC activity assay has been applied. The reaction composed of assa...
US Patent US10736881 (2020)
Histone deacetylase 1
(Homo sapiens (Human))
BDBM50248256
(3-(1-(4-(dimethylamino)butyl)-2-phenethyl-1H-benzo...)
Show SMILES CN(C)CCCCn1c(CCc2ccccc2)nc2cc(\C=C\C(=O)NO)ccc12
Show InChI InChI=1S/C24H30N4O2/c1-27(2)16-6-7-17-28-22-13-10-20(12-15-24(29)26-30)18-21(22)25-23(28)14-11-19-8-4-3-5-9-19/h3-5,8-10,12-13,15,18,30H,6-7,11,14,16-17H2,1-2H3,(H,26,29)/b15-12+
NCI pathway
Reactome pathway
US Patent
n/an/a 153n/an/an/an/an/an/a
MEI PHARMA, INC.
US Patent
Assay Description
The assay has been carried out in 96 well format and the BIOMOL fluorescent-based HDAC activity assay has been applied. The reaction composed of assa...
US Patent US10201527 (2019)
BindingDB Entry DOI: 10.7270/Q2PK0J7F