null
SMILES: OCCCn1c(nc2cc(\C=C\C(=O)NO)ccc12)-c1ccsc1
InChI Key: InChIKey=LLGDWRNFGQVXJV-HWKANZROSA-N
Activity Spreadsheet -- Enzyme Inhibition Constant Data from BindingDB
Found 7 hits for monomerid = 50248259
Trg + Lig
Ki
nM
ΔG°
kcal/mole
IC50
nM
Kd
nM
EC50/IC50
nM
koff
s-1
kon
M-1s-1
pHTemp
°C
Histone deacetylase 8
(Homo sapiens (Human))
BDBM50248259
(CHEMBL474546 | N-hydroxy-3-(1-(3-hydroxypropyl)-2-...)
Show SMILES OCCCn1c(nc2cc(\C=C\C(=O)NO)ccc12)-c1ccsc1
Show InChI InChI=1S/C17H17N3O3S/c21-8-1-7-20-15-4-2-12(3-5-16(22)19-23)10-14(15)18-17(20)13-6-9-24-11-13/h2-6,9-11,21,23H,1,7-8H2,(H,19,22)/b5-3+
NCI pathway
Reactome pathway
US Patent
n/an/a 537n/an/an/an/an/an/a
Mei Pharma, Inc.
US Patent
Assay Description
The assay have been carried out in a 96 well format and the BIOMOL using a fluorescent-based HDAC activity assay.
US Patent US8551988 (2013)
BindingDB Entry DOI: 10.7270/Q2BZ64P8
Histone deacetylase 1
(Homo sapiens (Human))
BDBM50248259
(CHEMBL474546 | N-hydroxy-3-(1-(3-hydroxypropyl)-2-...)
Show SMILES OCCCn1c(nc2cc(\C=C\C(=O)NO)ccc12)-c1ccsc1
Show InChI InChI=1S/C17H17N3O3S/c21-8-1-7-20-15-4-2-12(3-5-16(22)19-23)10-14(15)18-17(20)13-6-9-24-11-13/h2-6,9-11,21,23H,1,7-8H2,(H,19,22)/b5-3+
NCI pathway
Reactome pathway
US Patent
n/an/a 1.91E+3n/an/an/an/an/an/a
Mei Pharma, Inc.
US Patent
Assay Description
The assay have been carried out in a 96 well format and the BIOMOL using a fluorescent-based HDAC activity assay.
US Patent US8551988 (2013)
BindingDB Entry DOI: 10.7270/Q2BZ64P8
Histone deacetylase 1
(Homo sapiens (Human))
BDBM50248259
(CHEMBL474546 | N-hydroxy-3-(1-(3-hydroxypropyl)-2-...)
Show SMILES OCCCn1c(nc2cc(\C=C\C(=O)NO)ccc12)-c1ccsc1
Show InChI InChI=1S/C17H17N3O3S/c21-8-1-7-20-15-4-2-12(3-5-16(22)19-23)10-14(15)18-17(20)13-6-9-24-11-13/h2-6,9-11,21,23H,1,7-8H2,(H,19,22)/b5-3+
NCI pathway
Reactome pathway
n/an/a 1.90E+3n/an/an/an/an/an/a
S *BIO Pte Ltd
Curated by ChEMBL
Assay Description
Inhibition of recombinant HDAC1 by fluorimetric assay
Bioorg Med Chem Lett 19: 1403-8 (2009)
Article DOI: 10.1016/j.bmcl.2009.01.041
BindingDB Entry DOI: 10.7270/Q2FT8KX3
Histone deacetylase 8
(Homo sapiens (Human))
BDBM50248259
(CHEMBL474546 | N-hydroxy-3-(1-(3-hydroxypropyl)-2-...)
Show SMILES OCCCn1c(nc2cc(\C=C\C(=O)NO)ccc12)-c1ccsc1
Show InChI InChI=1S/C17H17N3O3S/c21-8-1-7-20-15-4-2-12(3-5-16(22)19-23)10-14(15)18-17(20)13-6-9-24-11-13/h2-6,9-11,21,23H,1,7-8H2,(H,19,22)/b5-3+
NCI pathway
Reactome pathway
US Patent
n/an/a 537n/an/an/an/an/an/a
MEI Pharma, Inc.
US Patent
US Patent US10736881 (2020)
Histone deacetylase 8
(Homo sapiens (Human))
BDBM50248259
(CHEMBL474546 | N-hydroxy-3-(1-(3-hydroxypropyl)-2-...)
Show SMILES OCCCn1c(nc2cc(\C=C\C(=O)NO)ccc12)-c1ccsc1
Show InChI InChI=1S/C17H17N3O3S/c21-8-1-7-20-15-4-2-12(3-5-16(22)19-23)10-14(15)18-17(20)13-6-9-24-11-13/h2-6,9-11,21,23H,1,7-8H2,(H,19,22)/b5-3+
NCI pathway
Reactome pathway
US Patent
n/an/a 537n/an/an/an/an/an/a
MEI PHARMA, INC.
US Patent
Assay Description
To determine EC50 where acetylated histone 3 was induced by 50%, Colo205 cells was cultivated in 96 well plate at 1.5×105 cells/well for 24 h. Colo20...
US Patent US10201527 (2019)
BindingDB Entry DOI: 10.7270/Q2PK0J7F
Histone deacetylase 1
(Homo sapiens (Human))
BDBM50248259
(CHEMBL474546 | N-hydroxy-3-(1-(3-hydroxypropyl)-2-...)
Show SMILES OCCCn1c(nc2cc(\C=C\C(=O)NO)ccc12)-c1ccsc1
Show InChI InChI=1S/C17H17N3O3S/c21-8-1-7-20-15-4-2-12(3-5-16(22)19-23)10-14(15)18-17(20)13-6-9-24-11-13/h2-6,9-11,21,23H,1,7-8H2,(H,19,22)/b5-3+
NCI pathway
Reactome pathway
US Patent
n/an/a 1.91E+3n/an/an/an/an/an/a
MEI Pharma, Inc.
US Patent
Assay Description
The assay has been carried out in 96 well format and the BIOMOL fluorescent-based HDAC activity assay has been applied. The reaction composed of assa...
US Patent US10736881 (2020)
Histone deacetylase 1
(Homo sapiens (Human))
BDBM50248259
(CHEMBL474546 | N-hydroxy-3-(1-(3-hydroxypropyl)-2-...)
Show SMILES OCCCn1c(nc2cc(\C=C\C(=O)NO)ccc12)-c1ccsc1
Show InChI InChI=1S/C17H17N3O3S/c21-8-1-7-20-15-4-2-12(3-5-16(22)19-23)10-14(15)18-17(20)13-6-9-24-11-13/h2-6,9-11,21,23H,1,7-8H2,(H,19,22)/b5-3+
NCI pathway
Reactome pathway
US Patent
n/an/a 1.91E+3n/an/an/an/an/an/a
MEI PHARMA, INC.
US Patent
Assay Description
The assay has been carried out in 96 well format and the BIOMOL fluorescent-based HDAC activity assay has been applied. The reaction composed of assa...
US Patent US10201527 (2019)
BindingDB Entry DOI: 10.7270/Q2PK0J7F