BDBM50248431 CHEMBL489125::N-hydroxy-3-(2-phenethyl-1-propyl-1H-benzo[d]imidazol-5-yl)acrylamide::US10201527, Compound 36::US10736881, Compound 36::US8551988, 36
SMILES: CCCn1c(CCc2ccccc2)nc2cc(\C=C\C(=O)NO)ccc12
InChI Key: InChIKey=IKIBXHADESLBBT-JLHYYAGUSA-N
Data: 4 IC50
Activity Spreadsheet -- Enzyme Inhibition Constant Data from BindingDB
Found 4 hits for monomerid = 50248431
Trg + Lig
Ki
nM
ΔG°
kcal/mole
IC50
nM
Kd
nM
EC50/IC50
nM
koff
s-1
kon
M-1s-1
pHTemp
°C
Histone deacetylase 1
(Homo sapiens (Human))
BDBM50248431
(CHEMBL489125 | N-hydroxy-3-(2-phenethyl-1-propyl-1...)
Show SMILES CCCn1c(CCc2ccccc2)nc2cc(\C=C\C(=O)NO)ccc12
Show InChI InChI=1S/C21H23N3O2/c1-2-14-24-19-11-8-17(10-13-21(25)23-26)15-18(19)22-20(24)12-9-16-6-4-3-5-7-16/h3-8,10-11,13,15,26H,2,9,12,14H2,1H3,(H,23,25)/b13-10+
NCI pathway
Reactome pathway
US Patent
n/an/a 227n/an/an/an/an/an/a
Mei Pharma, Inc.
US Patent
Assay Description
The assay have been carried out in a 96 well format and the BIOMOL using a fluorescent-based HDAC activity assay.
US Patent US8551988 (2013)
BindingDB Entry DOI: 10.7270/Q2BZ64P8
Cereblon/Histone deacetylase 1
(Homo sapiens (Human))
BDBM50248431
(CHEMBL489125 | N-hydroxy-3-(2-phenethyl-1-propyl-1...)
Show SMILES CCCn1c(CCc2ccccc2)nc2cc(\C=C\C(=O)NO)ccc12
Show InChI InChI=1S/C21H23N3O2/c1-2-14-24-19-11-8-17(10-13-21(25)23-26)15-18(19)22-20(24)12-9-16-6-4-3-5-7-16/h3-8,10-11,13,15,26H,2,9,12,14H2,1H3,(H,23,25)/b13-10+
NCI pathway
Reactome pathway
US Patent
n/an/a 227n/an/an/an/an/an/a
MEI Pharma, Inc.
US Patent
Assay Description
The assay has been carried out in 96 well format and the BIOMOL fluorescent-based HDAC activity assay has been applied. The reaction composed of assa...
US Patent US10736881 (2020)
Histone deacetylase 1
(Homo sapiens (Human))
BDBM50248431
(CHEMBL489125 | N-hydroxy-3-(2-phenethyl-1-propyl-1...)
Show SMILES CCCn1c(CCc2ccccc2)nc2cc(\C=C\C(=O)NO)ccc12
Show InChI InChI=1S/C21H23N3O2/c1-2-14-24-19-11-8-17(10-13-21(25)23-26)15-18(19)22-20(24)12-9-16-6-4-3-5-7-16/h3-8,10-11,13,15,26H,2,9,12,14H2,1H3,(H,23,25)/b13-10+
NCI pathway
Reactome pathway
US Patent
n/an/a 227n/an/an/an/an/an/a
MEI PHARMA, INC.
US Patent
Assay Description
The assay has been carried out in 96 well format and the BIOMOL fluorescent-based HDAC activity assay has been applied. The reaction composed of assa...
US Patent US10201527 (2019)
BindingDB Entry DOI: 10.7270/Q2PK0J7F
Histone deacetylase 1
(Homo sapiens (Human))
BDBM50248431
(CHEMBL489125 | N-hydroxy-3-(2-phenethyl-1-propyl-1...)
Show SMILES CCCn1c(CCc2ccccc2)nc2cc(\C=C\C(=O)NO)ccc12
Show InChI InChI=1S/C21H23N3O2/c1-2-14-24-19-11-8-17(10-13-21(25)23-26)15-18(19)22-20(24)12-9-16-6-4-3-5-7-16/h3-8,10-11,13,15,26H,2,9,12,14H2,1H3,(H,23,25)/b13-10+
NCI pathway
Reactome pathway
n/an/a 170n/an/an/an/an/an/a
S *BIO Pte Ltd
Curated by ChEMBL
Assay Description
Inhibition of recombinant HDAC1 by fluorimetric assay
Bioorg Med Chem Lett 19: 1403-8 (2009)
Article DOI: 10.1016/j.bmcl.2009.01.041
BindingDB Entry DOI: 10.7270/Q2FT8KX3