BDBM50248840 CHEMBL4096175
SMILES: Clc1cc2NC3C(C=C4N(C(=S)NC4=O)C3=O)c2c(Cl)c1
InChI Key: InChIKey=XUIHLAZYWIQDIJ-UHFFFAOYSA-N
Data: 1 IC50
Activity Spreadsheet -- Enzyme Inhibition Constant Data from BindingDB
Found 1 hit for monomerid = 50248840
Trg + Lig
Ki
nM
ΔG°
kcal/mole
IC50
nM
Kd
nM
EC50/IC50
nM
koff
s-1
kon
M-1s-1
pHTemp
°C
Serine/threonine-protein kinase pim-1
(Homo sapiens (Human))
BDBM50248840
(CHEMBL4096175)
Show SMILES Clc1cc2NC3C(C=C4N(C(=S)NC4=O)C3=O)c2c(Cl)c1 |c:7|
Show InChI InChI=1S/C13H7Cl2N3O2S/c14-4-1-6(15)9-5-3-8-11(19)17-13(21)18(8)12(20)10(5)16-7(9)2-4/h1-3,5,10,16H,(H,17,19,21)
n/an/a 131n/an/an/an/an/an/a
University of Oxford
Curated by ChEMBL
Assay Description
Inhibition of recombinant PIM1 (unknown origin) by pyruvate kinase/lactate dehydrogenase-coupled assay
Bioorg Med Chem 25: 2657-2665 (2017)
Article DOI: 10.1016/j.bmc.2017.02.056
BindingDB Entry DOI: 10.7270/Q2CV4M5V