BDBM50248865 CHEMBL4069055
SMILES: Cn1c(\C=C2/SC(=S)NC2=O)cc2sccc12
InChI Key: InChIKey=KODXSOUJVHJCNY-UITAMQMPSA-N
Data: 1 IC50
Activity Spreadsheet -- Enzyme Inhibition Constant Data from BindingDB
Found 1 hit for monomerid = 50248865
Trg + Lig
Ki
nM
ΔG°
kcal/mole
IC50
nM
Kd
nM
EC50/IC50
nM
koff
s-1
kon
M-1s-1
pHTemp
°C
Serine/threonine-protein kinase pim-1
(Homo sapiens (Human))
BDBM50248865
(CHEMBL4069055)
Show SMILES Cn1c(\C=C2/SC(=S)NC2=O)cc2sccc12
Show InChI InChI=1S/C11H8N2OS3/c1-13-6(4-8-7(13)2-3-16-8)5-9-10(14)12-11(15)17-9/h2-5H,1H3,(H,12,14,15)/b9-5-
n/an/a 36n/an/an/an/an/an/a
University of Oxford
Curated by ChEMBL
Assay Description
Inhibition of recombinant PIM1 (unknown origin) by pyruvate kinase/lactate dehydrogenase-coupled assay
Bioorg Med Chem 25: 2657-2665 (2017)
Article DOI: 10.1016/j.bmc.2017.02.056
BindingDB Entry DOI: 10.7270/Q2CV4M5V