BDBM50248875 CHEMBL4068388
SMILES: Clc1ccccc1\C=C1/SC(=S)NC1=O
InChI Key: InChIKey=AAIBSXUAGRXSIQ-YVMONPNESA-N
Data: 1 IC50
Activity Spreadsheet -- Enzyme Inhibition Constant Data from BindingDB
Found 1 hit for monomerid = 50248875
Trg + Lig
Ki
nM
ΔG°
kcal/mole
IC50
nM
Kd
nM
EC50/IC50
nM
koff
s-1
kon
M-1s-1
pHTemp
°C
Serine/threonine-protein kinase pim-1
(Homo sapiens (Human))
BDBM50248875
(CHEMBL4068388)
Show SMILES Clc1ccccc1\C=C1/SC(=S)NC1=O
Show InChI InChI=1S/C10H6ClNOS2/c11-7-4-2-1-3-6(7)5-8-9(13)12-10(14)15-8/h1-5H,(H,12,13,14)/b8-5-
n/an/a 320n/an/an/an/an/an/a
University of Oxford
Curated by ChEMBL
Assay Description
Inhibition of recombinant PIM1 (unknown origin) by pyruvate kinase/lactate dehydrogenase-coupled assay
Bioorg Med Chem 25: 2657-2665 (2017)
Article DOI: 10.1016/j.bmc.2017.02.056
BindingDB Entry DOI: 10.7270/Q2CV4M5V