BDBM50248911 CHEMBL2062727
SMILES: O=C1NC(=S)S\C1=C/c1cnc2ccccc2n1
InChI Key: InChIKey=XUUMNYDGUHORQI-YHYXMXQVSA-N
Data: 1 IC50
Activity Spreadsheet -- Enzyme Inhibition Constant Data from BindingDB
Found 1 hit for monomerid = 50248911
Trg + Lig
Ki
nM
ΔG°
kcal/mole
IC50
nM
Kd
nM
EC50/IC50
nM
koff
s-1
kon
M-1s-1
pHTemp
°C
Serine/threonine-protein kinase pim-1
(Homo sapiens (Human))
BDBM50248911
(CHEMBL2062727)
Show SMILES O=C1NC(=S)S\C1=C/c1cnc2ccccc2n1
Show InChI InChI=1S/C12H7N3OS2/c16-11-10(18-12(17)15-11)5-7-6-13-8-3-1-2-4-9(8)14-7/h1-6H,(H,15,16,17)/b10-5-
n/an/a 126n/an/an/an/an/an/a
University of Oxford
Curated by ChEMBL
Assay Description
Inhibition of recombinant PIM1 (unknown origin) by pyruvate kinase/lactate dehydrogenase-coupled assay
Bioorg Med Chem 25: 2657-2665 (2017)
Article DOI: 10.1016/j.bmc.2017.02.056
BindingDB Entry DOI: 10.7270/Q2CV4M5V