BDBM50249122 CHEMBL472779::N-(4-chloro-2-(5-chloropyridin-2-ylcarbamoyl)phenyl)-4-(N,N-dimethylcarbamimidoyl)-2-(2-methoxyethoxy)benzamide
SMILES: COCCOc1cc(ccc1C(=O)Nc1ccc(Cl)cc1C(=O)Nc1ccc(Cl)cn1)C(=N)N(C)C
InChI Key: InChIKey=PXUFHMXOOWIPEO-UHFFFAOYSA-N
Data: 1 IC50
Activity Spreadsheet -- Enzyme Inhibition Constant Data from BindingDB
Found 1 hit for monomerid = 50249122
Trg + Lig
Ki
nM
ΔG°
kcal/mole
IC50
nM
Kd
nM
EC50/IC50
nM
koff
s-1
kon
M-1s-1
pHTemp
°C
Coagulation factor X
(Homo sapiens (Human))
BDBM50249122
(CHEMBL472779 | N-(4-chloro-2-(5-chloropyridin-2-yl...)
Show SMILES COCCOc1cc(ccc1C(=O)Nc1ccc(Cl)cc1C(=O)Nc1ccc(Cl)cn1)C(=N)N(C)C
Show InChI InChI=1S/C25H25Cl2N5O4/c1-32(2)23(28)15-4-7-18(21(12-15)36-11-10-35-3)24(33)30-20-8-5-16(26)13-19(20)25(34)31-22-9-6-17(27)14-29-22/h4-9,12-14,28H,10-11H2,1-3H3,(H,30,33)(H,29,31,34)
Reactome pathway
n/an/a 1.20n/an/an/an/an/an/a
Millennium Pharmaceuticals, Inc
Curated by ChEMBL
Assay Description
Inhibition of Factor 10a (unknown origin)
Bioorg Med Chem Lett 19: 2179-85 (2009)
Article DOI: 10.1016/j.bmcl.2009.02.111
BindingDB Entry DOI: 10.7270/Q22Z15F5