BDBM50249193 (15R)-15-methyl-N-(1,3-thiazol-2-yl)tetracyclo[6.6.2.0^{2,7}.0^{9,14}]hexadeca-2,4,6,9(14),10,12-hexaene-15-carboxamide::CHEMBL514646
SMILES: C[C@]1(CC2c3ccccc3C1c1ccccc21)C(=O)Nc1nccs1
InChI Key: InChIKey=QYEYUIJWYCBKBG-WIXQSORDSA-N
Data: 4 KI  1 EC50
Activity Spreadsheet -- Enzyme Inhibition Constant Data from BindingDB
Found 5 hits for monomerid = 50249193
Trg + Lig
Ki
nM
ΔG°
kcal/mole
IC50
nM
Kd
nM
EC50/IC50
nM
koff
s-1
kon
M-1s-1
pHTemp
°C
Glucocorticoid receptor
(Homo sapiens (Human))
BDBM50249193
((15R)-15-methyl-N-(1,3-thiazol-2-yl)tetracyclo[6.6...)
Show SMILES C[C@]1(CC2c3ccccc3C1c1ccccc21)C(=O)Nc1nccs1 |r,wU:1.0,wD:1.20,TLB:0:1:4.9:11.16,8:9:2.1:11.16,12:11:4.9:2.1,THB:17:1:4.9:11.16,(7.07,-47.06,;8.41,-47.83,;8.92,-48.6,;8.93,-50.8,;7.06,-51.32,;5.71,-52.09,;4.38,-51.32,;4.38,-49.77,;5.71,-49,;7.02,-49.92,;8.41,-49.25,;9.95,-50.15,;11.22,-49.41,;12.5,-50.14,;12.51,-51.63,;11.23,-52.37,;9.95,-51.63,;9.17,-46.49,;8.38,-45.16,;10.71,-46.47,;11.47,-45.13,;13.01,-44.95,;13.31,-43.44,;11.97,-42.68,;10.83,-43.72,)|
Show InChI InChI=1S/C21H18N2OS/c1-21(19(24)23-20-22-10-11-25-20)12-17-13-6-2-4-8-15(13)18(21)16-9-5-3-7-14(16)17/h2-11,17-18H,12H2,1H3,(H,22,23,24)/t17?,18?,21-/m1/s1
1.30n/an/an/an/an/an/an/an/a
Bristol-Myers Squibb
Curated by ChEMBL
Assay Description
Displacement of FITC-dexamethasone from human recombinant glucocorticoid receptor alpha by fluorescence polarization assay
Bioorg Med Chem Lett 19: 2139-43 (2009)
Article DOI: 10.1016/j.bmcl.2009.03.006
BindingDB Entry DOI: 10.7270/Q2XW4KRC
Progesterone receptor
(Homo sapiens (Human))
BDBM50249193
((15R)-15-methyl-N-(1,3-thiazol-2-yl)tetracyclo[6.6...)
Show SMILES C[C@]1(CC2c3ccccc3C1c1ccccc21)C(=O)Nc1nccs1 |r,wU:1.0,wD:1.20,TLB:0:1:4.9:11.16,8:9:2.1:11.16,12:11:4.9:2.1,THB:17:1:4.9:11.16,(7.07,-47.06,;8.41,-47.83,;8.92,-48.6,;8.93,-50.8,;7.06,-51.32,;5.71,-52.09,;4.38,-51.32,;4.38,-49.77,;5.71,-49,;7.02,-49.92,;8.41,-49.25,;9.95,-50.15,;11.22,-49.41,;12.5,-50.14,;12.51,-51.63,;11.23,-52.37,;9.95,-51.63,;9.17,-46.49,;8.38,-45.16,;10.71,-46.47,;11.47,-45.13,;13.01,-44.95,;13.31,-43.44,;11.97,-42.68,;10.83,-43.72,)|
Show InChI InChI=1S/C21H18N2OS/c1-21(19(24)23-20-22-10-11-25-20)12-17-13-6-2-4-8-15(13)18(21)16-9-5-3-7-14(16)17/h2-11,17-18H,12H2,1H3,(H,22,23,24)/t17?,18?,21-/m1/s1
147n/an/an/an/an/an/an/an/a
Bristol-Myers Squibb
Curated by ChEMBL
Assay Description
Displacement of radioligand from progesterone receptor by fluorescence polarization assay
Bioorg Med Chem Lett 19: 2139-43 (2009)
Article DOI: 10.1016/j.bmcl.2009.03.006
BindingDB Entry DOI: 10.7270/Q2XW4KRC
Androgen Receptor
(Homo sapiens (Human))
BDBM50249193
((15R)-15-methyl-N-(1,3-thiazol-2-yl)tetracyclo[6.6...)
Show SMILES C[C@]1(CC2c3ccccc3C1c1ccccc21)C(=O)Nc1nccs1 |r,wU:1.0,wD:1.20,TLB:0:1:4.9:11.16,8:9:2.1:11.16,12:11:4.9:2.1,THB:17:1:4.9:11.16,(7.07,-47.06,;8.41,-47.83,;8.92,-48.6,;8.93,-50.8,;7.06,-51.32,;5.71,-52.09,;4.38,-51.32,;4.38,-49.77,;5.71,-49,;7.02,-49.92,;8.41,-49.25,;9.95,-50.15,;11.22,-49.41,;12.5,-50.14,;12.51,-51.63,;11.23,-52.37,;9.95,-51.63,;9.17,-46.49,;8.38,-45.16,;10.71,-46.47,;11.47,-45.13,;13.01,-44.95,;13.31,-43.44,;11.97,-42.68,;10.83,-43.72,)|
Show InChI InChI=1S/C21H18N2OS/c1-21(19(24)23-20-22-10-11-25-20)12-17-13-6-2-4-8-15(13)18(21)16-9-5-3-7-14(16)17/h2-11,17-18H,12H2,1H3,(H,22,23,24)/t17?,18?,21-/m1/s1
NCI pathway
Reactome pathway
7.40E+3n/an/an/an/an/an/an/an/a
Bristol-Myers Squibb
Curated by ChEMBL
Assay Description
Displacement of radioligand from androgen receptor by fluorescence polarization assay
Bioorg Med Chem Lett 19: 2139-43 (2009)
Article DOI: 10.1016/j.bmcl.2009.03.006
BindingDB Entry DOI: 10.7270/Q2XW4KRC
Estrogen receptor
(Homo sapiens (Human))
BDBM50249193
((15R)-15-methyl-N-(1,3-thiazol-2-yl)tetracyclo[6.6...)
Show SMILES C[C@]1(CC2c3ccccc3C1c1ccccc21)C(=O)Nc1nccs1 |r,wU:1.0,wD:1.20,TLB:0:1:4.9:11.16,8:9:2.1:11.16,12:11:4.9:2.1,THB:17:1:4.9:11.16,(7.07,-47.06,;8.41,-47.83,;8.92,-48.6,;8.93,-50.8,;7.06,-51.32,;5.71,-52.09,;4.38,-51.32,;4.38,-49.77,;5.71,-49,;7.02,-49.92,;8.41,-49.25,;9.95,-50.15,;11.22,-49.41,;12.5,-50.14,;12.51,-51.63,;11.23,-52.37,;9.95,-51.63,;9.17,-46.49,;8.38,-45.16,;10.71,-46.47,;11.47,-45.13,;13.01,-44.95,;13.31,-43.44,;11.97,-42.68,;10.83,-43.72,)|
Show InChI InChI=1S/C21H18N2OS/c1-21(19(24)23-20-22-10-11-25-20)12-17-13-6-2-4-8-15(13)18(21)16-9-5-3-7-14(16)17/h2-11,17-18H,12H2,1H3,(H,22,23,24)/t17?,18?,21-/m1/s1
1.50E+4n/an/an/an/an/an/an/an/a
Bristol-Myers Squibb
Curated by ChEMBL
Assay Description
Displacement of radioligand from estrogen receptor alpha by fluorescence polarization assay
Bioorg Med Chem Lett 19: 2139-43 (2009)
Article DOI: 10.1016/j.bmcl.2009.03.006
BindingDB Entry DOI: 10.7270/Q2XW4KRC
Glucocorticoid receptor
(Homo sapiens (Human))
BDBM50249193
((15R)-15-methyl-N-(1,3-thiazol-2-yl)tetracyclo[6.6...)
Show SMILES C[C@]1(CC2c3ccccc3C1c1ccccc21)C(=O)Nc1nccs1 |r,wU:1.0,wD:1.20,TLB:0:1:4.9:11.16,8:9:2.1:11.16,12:11:4.9:2.1,THB:17:1:4.9:11.16,(7.07,-47.06,;8.41,-47.83,;8.92,-48.6,;8.93,-50.8,;7.06,-51.32,;5.71,-52.09,;4.38,-51.32,;4.38,-49.77,;5.71,-49,;7.02,-49.92,;8.41,-49.25,;9.95,-50.15,;11.22,-49.41,;12.5,-50.14,;12.51,-51.63,;11.23,-52.37,;9.95,-51.63,;9.17,-46.49,;8.38,-45.16,;10.71,-46.47,;11.47,-45.13,;13.01,-44.95,;13.31,-43.44,;11.97,-42.68,;10.83,-43.72,)|
Show InChI InChI=1S/C21H18N2OS/c1-21(19(24)23-20-22-10-11-25-20)12-17-13-6-2-4-8-15(13)18(21)16-9-5-3-7-14(16)17/h2-11,17-18H,12H2,1H3,(H,22,23,24)/t17?,18?,21-/m1/s1
n/an/an/an/a 115n/an/an/an/a
Bristol-Myers Squibb
Curated by ChEMBL
Assay Description
Transrepression activity at GR in PMA-stimulated human A549 cells assessed as inhibition of AP1 response element-induced luciferase reporter gene act...
Bioorg Med Chem Lett 19: 2139-43 (2009)
Article DOI: 10.1016/j.bmcl.2009.03.006
BindingDB Entry DOI: 10.7270/Q2XW4KRC