BDBM50249296 3-chloro-N-(5-chloropyridin-2-yl)-2-(4-(N,N-dimethylcarbamimidoyl)benzamido)benzamide::CHEMBL471726
SMILES: CN(C)C(=N)c1ccc(cc1)C(=O)Nc1c(Cl)cccc1C(=O)Nc1ccc(Cl)cn1
InChI Key: InChIKey=LJYUVBYMIPFMRT-UHFFFAOYSA-N
Data: 1 IC50
Activity Spreadsheet -- Enzyme Inhibition Constant Data from BindingDB
Found 1 hit for monomerid = 50249296
Trg + Lig
Ki
nM
ΔG°
kcal/mole
IC50
nM
Kd
nM
EC50/IC50
nM
koff
s-1
kon
M-1s-1
pHTemp
°C
Coagulation factor X
(Homo sapiens (Human))
BDBM50249296
(3-chloro-N-(5-chloropyridin-2-yl)-2-(4-(N,N-dimeth...)
Show SMILES CN(C)C(=N)c1ccc(cc1)C(=O)Nc1c(Cl)cccc1C(=O)Nc1ccc(Cl)cn1
Show InChI InChI=1S/C22H19Cl2N5O2/c1-29(2)20(25)13-6-8-14(9-7-13)21(30)28-19-16(4-3-5-17(19)24)22(31)27-18-11-10-15(23)12-26-18/h3-12,25H,1-2H3,(H,28,30)(H,26,27,31)
Reactome pathway
n/an/a 21n/an/an/an/an/an/a
Millennium Pharmaceuticals, Inc
Curated by ChEMBL
Assay Description
Inhibition of Factor 10a (unknown origin)
Bioorg Med Chem Lett 19: 2179-85 (2009)
Article DOI: 10.1016/j.bmcl.2009.02.111
BindingDB Entry DOI: 10.7270/Q22Z15F5