BDBM50249365 (R)-2-((3S,4S)-3-((4-(2-benzylthiazol-5-yl)piperidin-1-yl)methyl)-4-phenylpyrrolidin-1-yl)-3-cyclobutylpropanoic acid::CHEMBL511493
SMILES: OC(=O)[C@@H](CC1CCC1)N1C[C@H](CN2CCC(CC2)c2cnc(Cc3ccccc3)s2)[C@H](C1)c1ccccc1
InChI Key: InChIKey=UUQGJUFZXHHWRQ-FRXPANAUSA-N
Data: 1 IC50
Activity Spreadsheet -- Enzyme Inhibition Constant Data from BindingDB
Found 1 hit for monomerid = 50249365
Trg + Lig
Ki
nM
ΔG°
kcal/mole
IC50
nM
Kd
nM
EC50/IC50
nM
koff
s-1
kon
M-1s-1
pHTemp
°C
C-C chemokine receptor type 5
(Homo sapiens (Human))
BDBM50249365
((R)-2-((3S,4S)-3-((4-(2-benzylthiazol-5-yl)piperid...)
Show SMILES OC(=O)[C@@H](CC1CCC1)N1C[C@H](CN2CCC(CC2)c2cnc(Cc3ccccc3)s2)[C@H](C1)c1ccccc1 |r|
Show InChI InChI=1S/C33H41N3O2S/c37-33(38)30(18-24-10-7-11-24)36-22-28(29(23-36)26-12-5-2-6-13-26)21-35-16-14-27(15-17-35)31-20-34-32(39-31)19-25-8-3-1-4-9-25/h1-6,8-9,12-13,20,24,27-30H,7,10-11,14-19,21-23H2,(H,37,38)/t28-,29+,30+/m0/s1
n/an/a 0.230n/an/an/an/an/an/a
Beijing University of Technology
Curated by ChEMBL
Assay Description
Displacement of [125I]MIP1alpha from human CCR5 expressed in CHO cells
Eur J Med Chem 43: 2724-34 (2008)
Article DOI: 10.1016/j.ejmech.2008.01.040
BindingDB Entry DOI: 10.7270/Q2G44Q3W