BDBM50249480 CHEMBL475246::cis-((2S,4S)-4-(4-(benzo[d]isoxazol-3-yl)piperazin-1-yl)pyrrolidin-2-yl)(3,3-difluoropyrrolidin-1-yl)methanone
SMILES: FC1(F)CCN(C1)C(=O)[C@@H]1C[C@@H](CN1)N1CCN(CC1)c1noc2ccccc12
InChI Key: InChIKey=WEDPAVPEFJUWLX-HOCLYGCPSA-N
Data: 3 IC50
Activity Spreadsheet -- Enzyme Inhibition Constant Data from BindingDB
Found 3 hits for monomerid = 50249480
Trg + Lig
Ki
nM
ΔG°
kcal/mole
IC50
nM
Kd
nM
EC50/IC50
nM
koff
s-1
kon
M-1s-1
pHTemp
°C
Dipeptidyl peptidase 4
(Homo sapiens (Human))
BDBM50249480
(CHEMBL475246 | cis-((2S,4S)-4-(4-(benzo[d]isoxazol...)
Show SMILES FC1(F)CCN(C1)C(=O)[C@@H]1C[C@@H](CN1)N1CCN(CC1)c1noc2ccccc12 |r|
Show InChI InChI=1S/C20H25F2N5O2/c21-20(22)5-6-27(13-20)19(28)16-11-14(12-23-16)25-7-9-26(10-8-25)18-15-3-1-2-4-17(15)29-24-18/h1-4,14,16,23H,5-13H2/t14-,16-/m0/s1
Reactome pathway
n/an/a 8.70n/an/an/an/an/an/a
Pfizer Global Research & Development
Curated by ChEMBL
Assay Description
Inhibition of human plasma DPP4
Bioorg Med Chem Lett 19: 1991-5 (2009)
Article DOI: 10.1016/j.bmcl.2009.02.041
BindingDB Entry DOI: 10.7270/Q2FB52S4
Dipeptidyl peptidase VIII
(Homo sapiens (Human))
BDBM50249480
(CHEMBL475246 | cis-((2S,4S)-4-(4-(benzo[d]isoxazol...)
Show SMILES FC1(F)CCN(C1)C(=O)[C@@H]1C[C@@H](CN1)N1CCN(CC1)c1noc2ccccc12 |r|
Show InChI InChI=1S/C20H25F2N5O2/c21-20(22)5-6-27(13-20)19(28)16-11-14(12-23-16)25-7-9-26(10-8-25)18-15-3-1-2-4-17(15)29-24-18/h1-4,14,16,23H,5-13H2/t14-,16-/m0/s1
n/an/a 2.24E+3n/an/an/an/an/an/a
Pfizer Global Research & Development
Curated by ChEMBL
Assay Description
Inhibition of human recombinant DPP8
Bioorg Med Chem Lett 19: 1991-5 (2009)
Article DOI: 10.1016/j.bmcl.2009.02.041
BindingDB Entry DOI: 10.7270/Q2FB52S4
Dipeptidyl peptidase 2 (DPP II)
(Homo sapiens (Human))
BDBM50249480
(CHEMBL475246 | cis-((2S,4S)-4-(4-(benzo[d]isoxazol...)
Show SMILES FC1(F)CCN(C1)C(=O)[C@@H]1C[C@@H](CN1)N1CCN(CC1)c1noc2ccccc12 |r|
Show InChI InChI=1S/C20H25F2N5O2/c21-20(22)5-6-27(13-20)19(28)16-11-14(12-23-16)25-7-9-26(10-8-25)18-15-3-1-2-4-17(15)29-24-18/h1-4,14,16,23H,5-13H2/t14-,16-/m0/s1
n/an/a 1.23E+3n/an/an/an/an/an/a
Pfizer Global Research & Development
Curated by ChEMBL
Assay Description
Inhibition of human recombinant DPP2
Bioorg Med Chem Lett 19: 1991-5 (2009)
Article DOI: 10.1016/j.bmcl.2009.02.041
BindingDB Entry DOI: 10.7270/Q2FB52S4