BDBM50249492 (R)-2-((3S,4S)-3-((4-(2-benzyl-4-ethylthiazol-5-yl)piperidin-1-yl)methyl)-4-phenylpyrrolidin-1-yl)-3-cyclobutylpropanoic acid::CHEMBL471251
SMILES: CCc1nc(Cc2ccccc2)sc1C1CCN(C[C@H]2CN(C[C@@H]2c2ccccc2)[C@H](CC2CCC2)C(O)=O)CC1
InChI Key: InChIKey=IQJNWNIJNCRMPS-XAGDYJCDSA-N
Data: 1 IC50
Activity Spreadsheet -- Enzyme Inhibition Constant Data from BindingDB
Found 1 hit for monomerid = 50249492
Trg + Lig
Ki
nM
ΔG°
kcal/mole
IC50
nM
Kd
nM
EC50/IC50
nM
koff
s-1
kon
M-1s-1
pHTemp
°C
C-C chemokine receptor type 5
(Homo sapiens (Human))
BDBM50249492
((R)-2-((3S,4S)-3-((4-(2-benzyl-4-ethylthiazol-5-yl...)
Show SMILES CCc1nc(Cc2ccccc2)sc1C1CCN(C[C@H]2CN(C[C@@H]2c2ccccc2)[C@H](CC2CCC2)C(O)=O)CC1 |r|
Show InChI InChI=1S/C35H45N3O2S/c1-2-31-34(41-33(36-31)21-26-10-5-3-6-11-26)28-16-18-37(19-17-28)22-29-23-38(24-30(29)27-14-7-4-8-15-27)32(35(39)40)20-25-12-9-13-25/h3-8,10-11,14-15,25,28-30,32H,2,9,12-13,16-24H2,1H3,(H,39,40)/t29-,30+,32+/m0/s1
n/an/a 0.760n/an/an/an/an/an/a
Beijing University of Technology
Curated by ChEMBL
Assay Description
Displacement of [125I]MIP1alpha from human CCR5 expressed in CHO cells
Eur J Med Chem 43: 2724-34 (2008)
Article DOI: 10.1016/j.ejmech.2008.01.040
BindingDB Entry DOI: 10.7270/Q2G44Q3W