BDBM50249757 2-[(5S)-4,4-Bis(4-fluorophenyl)-5-methyl-4,5-dihydro-1H-imidazol-2-yl]pyrazine Hydrochloride::CHEMBL491119
SMILES: C[C@@H]1NC(=NC1(c1ccc(F)cc1)c1ccc(F)cc1)c1cnccn1
InChI Key: InChIKey=JOKLLFKJXMPKTA-ZDUSSCGKSA-N
Data: 1 KI  1 IC50
Activity Spreadsheet -- Enzyme Inhibition Constant Data from BindingDB
Found 2 hits for monomerid = 50249757
Trg + Lig
Ki
nM
ΔG°
kcal/mole
IC50
nM
Kd
nM
EC50/IC50
nM
koff
s-1
kon
M-1s-1
pHTemp
°C
Neuropeptide Y receptor type 5 ( NPY Y5)
(Homo sapiens (Human))
BDBM50249757
(2-[(5S)-4,4-Bis(4-fluorophenyl)-5-methyl-4,5-dihyd...)
Show SMILES C[C@@H]1NC(=NC1(c1ccc(F)cc1)c1ccc(F)cc1)c1cnccn1 |r,c:3|
Show InChI InChI=1S/C20H16F2N4/c1-13-20(14-2-6-16(21)7-3-14,15-4-8-17(22)9-5-15)26-19(25-13)18-12-23-10-11-24-18/h2-13H,1H3,(H,25,26)/t13-/m0/s1
1.90n/an/an/an/an/an/an/an/a
Tsukuba Research Institute
Curated by ChEMBL
Assay Description
Displacement of [125I]PYY from human recombinant neuropeptide Y5 receptor expressed in mouse LMtk- cells
J Med Chem 52: 3385-96 (2009)
Article DOI: 10.1021/jm900110t
BindingDB Entry DOI: 10.7270/Q2DN450G
Potassium voltage-gated channel subfamily H member 2
(Homo sapiens (Human))
BDBM50249757
(2-[(5S)-4,4-Bis(4-fluorophenyl)-5-methyl-4,5-dihyd...)
Show SMILES C[C@@H]1NC(=NC1(c1ccc(F)cc1)c1ccc(F)cc1)c1cnccn1 |r,c:3|
Show InChI InChI=1S/C20H16F2N4/c1-13-20(14-2-6-16(21)7-3-14,15-4-8-17(22)9-5-15)26-19(25-13)18-12-23-10-11-24-18/h2-13H,1H3,(H,25,26)/t13-/m0/s1
Reactome pathway
n/an/a>1.00E+4n/an/an/an/an/an/a
Tsukuba Research Institute
Curated by ChEMBL
Assay Description
Displacement of [35S]N-[(4R)-1'-[(2R)-6-cyano-1,2,3,4-tetrahydro-2-naphthyl]-3,4-dihydro-4-hydroxyspiro[2H-1-benzopyran-2,4'-piperidin]6-yl]methanesu...
J Med Chem 52: 3385-96 (2009)
Article DOI: 10.1021/jm900110t
BindingDB Entry DOI: 10.7270/Q2DN450G