BDBM50249763 CHEMBL4064071
SMILES: Cn1c2ccc(cc2ccc1=O)S(=O)(=O)Nc1ccc(cc1)C#N
InChI Key: InChIKey=BXGJNRVCUDKEGW-UHFFFAOYSA-N
Data: 3 IC50
Activity Spreadsheet -- Enzyme Inhibition Constant Data from BindingDB
Found 2 hits for monomerid = 50249763
Trg + Lig
Ki
nM
ΔG°
kcal/mole
IC50
nM
Kd
nM
EC50/IC50
nM
koff
s-1
kon
M-1s-1
pHTemp
°C
Dual-specificity tyrosine-(Y)-phosphorylation regulated kinase 1A
(RAT)
BDBM50249763
(CHEMBL4794934)
Show SMILES Cn1c2ccc(cc2ccc1=O)S(=O)(=O)Nc1ccc(cc1)C#N
Show InChI InChI=1S/C17H13N3O3S/c1-20-16-8-7-15(10-13(16)4-9-17(20)21)24(22,23)19-14-5-2-12(11-18)3-6-14/h2-10,19H,1H3
n/an/a 80n/an/an/an/an/an/a
TBA
Assay Description
Binding affinity to partial length human BRD9 by BROMOscan assay
Citation and Details
Dual specificity protein kinase CLK1
(Mus musculus)
BDBM50249763
(CHEMBL4794934)
Show SMILES Cn1c2ccc(cc2ccc1=O)S(=O)(=O)Nc1ccc(cc1)C#N
Show InChI InChI=1S/C17H13N3O3S/c1-20-16-8-7-15(10-13(16)4-9-17(20)21)24(22,23)19-14-5-2-12(11-18)3-6-14/h2-10,19H,1H3
n/an/a 160n/an/an/an/an/an/a
TBA
Assay Description
Inhibition of BRD4 bromodomain 1 (unknown origin) incubated in dark for 30 mins by TR-FRET assay
Citation and Details