BDBM50249777 2-{(4S,5S)-4-(4-Fluorophenyl)-5-methyl-4-[6-(methyloxy)-3-pyridyl]-4,5-dihydro-1H-imidazol-2-yl}-4-pyridinecarbonitrile Hydrochloride::CHEMBL506163
SMILES: COc1ccc(cn1)[C@@]1(N=C(N[C@H]1C)c1cc(ccn1)C#N)c1ccc(F)cc1
InChI Key: InChIKey=BARLPLQJPYXWNJ-FPTDNZKUSA-N
Data: 1 KI  1 IC50
Activity Spreadsheet -- Enzyme Inhibition Constant Data from BindingDB
Found 2 hits for monomerid = 50249777
Trg + Lig
Ki
nM
ΔG°
kcal/mole
IC50
nM
Kd
nM
EC50/IC50
nM
koff
s-1
kon
M-1s-1
pHTemp
°C
Neuropeptide Y receptor type 5 ( NPY Y5)
(Homo sapiens (Human))
BDBM50249777
(2-{(4S,5S)-4-(4-Fluorophenyl)-5-methyl-4-[6-(methy...)
Show SMILES COc1ccc(cn1)[C@@]1(N=C(N[C@H]1C)c1cc(ccn1)C#N)c1ccc(F)cc1 |r,c:10|
Show InChI InChI=1S/C22H18FN5O/c1-14-22(16-3-6-18(23)7-4-16,17-5-8-20(29-2)26-13-17)28-21(27-14)19-11-15(12-24)9-10-25-19/h3-11,13-14H,1-2H3,(H,27,28)/t14-,22-/m0/s1
1.10n/an/an/an/an/an/an/an/a
Tsukuba Research Institute
Curated by ChEMBL
Assay Description
Displacement of [125I]PYY from human recombinant neuropeptide Y5 receptor expressed in mouse LMtk- cells
J Med Chem 52: 3385-96 (2009)
Article DOI: 10.1021/jm900110t
BindingDB Entry DOI: 10.7270/Q2DN450G
Potassium voltage-gated channel subfamily H member 2
(Homo sapiens (Human))
BDBM50249777
(2-{(4S,5S)-4-(4-Fluorophenyl)-5-methyl-4-[6-(methy...)
Show SMILES COc1ccc(cn1)[C@@]1(N=C(N[C@H]1C)c1cc(ccn1)C#N)c1ccc(F)cc1 |r,c:10|
Show InChI InChI=1S/C22H18FN5O/c1-14-22(16-3-6-18(23)7-4-16,17-5-8-20(29-2)26-13-17)28-21(27-14)19-11-15(12-24)9-10-25-19/h3-11,13-14H,1-2H3,(H,27,28)/t14-,22-/m0/s1
Reactome pathway
n/an/a 6.30E+3n/an/an/an/an/an/a
Tsukuba Research Institute
Curated by ChEMBL
Assay Description
Displacement of [35S]N-[(4R)-1'-[(2R)-6-cyano-1,2,3,4-tetrahydro-2-naphthyl]-3,4-dihydro-4-hydroxyspiro[2H-1-benzopyran-2,4'-piperidin]6-yl]methanesu...
J Med Chem 52: 3385-96 (2009)
Article DOI: 10.1021/jm900110t
BindingDB Entry DOI: 10.7270/Q2DN450G