BDBM50249803 2-Fluoro-5-{(4S,5S)-4-(4-fluorophenyl)-5-methyl-2-[3-(methylsulfonyl) phenyl]-4,5-dihydro-1H-imidazol-4-yl}pyridine::CHEMBL491894
SMILES: C[C@@H]1NC(=N[C@@]1(c1ccc(F)cc1)c1ccc(F)nc1)c1cccc(c1)S(C)(=O)=O
InChI Key: InChIKey=HBSAUESUTTXZJO-FPTDNZKUSA-N
Data: 1 KI  1 IC50
Activity Spreadsheet -- Enzyme Inhibition Constant Data from BindingDB
Found 2 hits for monomerid = 50249803
Trg + Lig
Ki
nM
ΔG°
kcal/mole
IC50
nM
Kd
nM
EC50/IC50
nM
koff
s-1
kon
M-1s-1
pHTemp
°C
Neuropeptide Y receptor type 5 ( NPY Y5)
(Homo sapiens (Human))
BDBM50249803
(2-Fluoro-5-{(4S,5S)-4-(4-fluorophenyl)-5-methyl-2-...)
Show SMILES C[C@@H]1NC(=N[C@@]1(c1ccc(F)cc1)c1ccc(F)nc1)c1cccc(c1)S(C)(=O)=O |r,c:3|
Show InChI InChI=1S/C22H19F2N3O2S/c1-14-22(16-6-9-18(23)10-7-16,17-8-11-20(24)25-13-17)27-21(26-14)15-4-3-5-19(12-15)30(2,28)29/h3-14H,1-2H3,(H,26,27)/t14-,22-/m0/s1
2.5n/an/an/an/an/an/an/an/a
Tsukuba Research Institute
Curated by ChEMBL
Assay Description
Displacement of [125I]PYY from human recombinant neuropeptide Y5 receptor expressed in mouse LMtk- cells
J Med Chem 52: 3385-96 (2009)
Article DOI: 10.1021/jm900110t
BindingDB Entry DOI: 10.7270/Q2DN450G
Potassium voltage-gated channel subfamily H member 2
(Homo sapiens (Human))
BDBM50249803
(2-Fluoro-5-{(4S,5S)-4-(4-fluorophenyl)-5-methyl-2-...)
Show SMILES C[C@@H]1NC(=N[C@@]1(c1ccc(F)cc1)c1ccc(F)nc1)c1cccc(c1)S(C)(=O)=O |r,c:3|
Show InChI InChI=1S/C22H19F2N3O2S/c1-14-22(16-6-9-18(23)10-7-16,17-8-11-20(24)25-13-17)27-21(26-14)15-4-3-5-19(12-15)30(2,28)29/h3-14H,1-2H3,(H,26,27)/t14-,22-/m0/s1
Reactome pathway
n/an/a>1.00E+4n/an/an/an/an/an/a
Tsukuba Research Institute
Curated by ChEMBL
Assay Description
Displacement of [35S]N-[(4R)-1'-[(2R)-6-cyano-1,2,3,4-tetrahydro-2-naphthyl]-3,4-dihydro-4-hydroxyspiro[2H-1-benzopyran-2,4'-piperidin]6-yl]methanesu...
J Med Chem 52: 3385-96 (2009)
Article DOI: 10.1021/jm900110t
BindingDB Entry DOI: 10.7270/Q2DN450G