BDBM50250848 CHEMBL4059676
SMILES: FC(F)(F)C(OC(=O)N1CC(C1)c1ccn(n1)-c1ccccc1)C(F)(F)F
InChI Key: InChIKey=ZWEMGIQYCJPRLW-UHFFFAOYSA-N
Data: 2 IC50
Activity Spreadsheet -- Enzyme Inhibition Constant Data from BindingDB
Found 2 hits for monomerid = 50250848
Trg + Lig
Ki
nM
ΔG°
kcal/mole
IC50
nM
Kd
nM
EC50/IC50
nM
koff
s-1
kon
M-1s-1
pHTemp
°C
Monoglyceride lipase
(Homo sapiens (Human))
BDBM50250848
(CHEMBL4059676)
Show SMILES FC(F)(F)C(OC(=O)N1CC(C1)c1ccn(n1)-c1ccccc1)C(F)(F)F
Show InChI InChI=1S/C16H13F6N3O2/c17-15(18,19)13(16(20,21)22)27-14(26)24-8-10(9-24)12-6-7-25(23-12)11-4-2-1-3-5-11/h1-7,10,13H,8-9H2
Reactome pathway
n/an/a 0.180n/an/an/an/an/an/a
Pfizer Inc.
Curated by ChEMBL
Assay Description
Inhibition of MAGL in human brain vascular pericytes after 1 hr by TAMRA azide-based In-gel fluorescence method
J Med Chem 60: 9860-9873 (2017)
Article DOI: 10.1021/acs.jmedchem.7b01531
BindingDB Entry DOI: 10.7270/Q2N300CG
Fatty-acid amide hydrolase 1
(Homo sapiens (Human))
BDBM50250848
(CHEMBL4059676)
Show SMILES FC(F)(F)C(OC(=O)N1CC(C1)c1ccn(n1)-c1ccccc1)C(F)(F)F
Show InChI InChI=1S/C16H13F6N3O2/c17-15(18,19)13(16(20,21)22)27-14(26)24-8-10(9-24)12-6-7-25(23-12)11-4-2-1-3-5-11/h1-7,10,13H,8-9H2
n/an/a 260n/an/an/an/an/an/a
Pfizer Inc.
Curated by ChEMBL
Assay Description
Inhibition of human recombinant FAAH using arachidonoyl-AMC as substrate preincubated for 30 mins followed by substrate addition measured after 60 mi...
J Med Chem 60: 9860-9873 (2017)
Article DOI: 10.1021/acs.jmedchem.7b01531
BindingDB Entry DOI: 10.7270/Q2N300CG