BDBM50250860 CHEMBL4062567
SMILES: OC(=O)c1cc(F)c2nc(sc2c1)N1C2CCC1CC(C2)OCc1c(onc1-c1ccccc1OC(F)(F)F)C1CC1
InChI Key: InChIKey=VYLOOGHLKSNNEK-UHFFFAOYSA-N
Data: 4 EC50
PDB links: 1 PDB ID matches this monomer.
Activity Spreadsheet -- Enzyme Inhibition Constant Data from BindingDB
Found 4 hits for monomerid = 50250860
Trg + Lig
Ki
nM
ΔG°
kcal/mole
IC50
nM
Kd
nM
EC50/IC50
nM
koff
s-1
kon
M-1s-1
pHTemp
°C
G-protein coupled bile acid receptor 1
(Homo sapiens (Human))
BDBM50250860
(CHEMBL4062567)
Show SMILES OC(=O)c1cc(F)c2nc(sc2c1)N1C2CCC1CC(C2)OCc1c(onc1-c1ccccc1OC(F)(F)F)C1CC1 |THB:21:19:15.16:13|
Show InChI InChI=1S/C29H25F4N3O5S/c30-21-9-15(27(37)38)10-23-25(21)34-28(42-23)36-16-7-8-17(36)12-18(11-16)39-13-20-24(35-41-26(20)14-5-6-14)19-3-1-2-4-22(19)40-29(31,32)33/h1-4,9-10,14,16-18H,5-8,11-13H2,(H,37,38)
Reactome pathway
n/an/an/an/a>1.00E+4n/an/an/an/a
Genomics Institute of the Novartis Research Foundation
Curated by ChEMBL
Assay Description
Agonist activity at human TGR5
J Med Chem 60: 9960-9973 (2017)
Article DOI: 10.1021/acs.jmedchem.7b00907
BindingDB Entry DOI: 10.7270/Q2H997N6
Bile acid receptor FXR
(Homo sapiens (Human))
BDBM50250860
(CHEMBL4062567)
Show SMILES OC(=O)c1cc(F)c2nc(sc2c1)N1C2CCC1CC(C2)OCc1c(onc1-c1ccccc1OC(F)(F)F)C1CC1 |THB:21:19:15.16:13|
Show InChI InChI=1S/C29H25F4N3O5S/c30-21-9-15(27(37)38)10-23-25(21)34-28(42-23)36-16-7-8-17(36)12-18(11-16)39-13-20-24(35-41-26(20)14-5-6-14)19-3-1-2-4-22(19)40-29(31,32)33/h1-4,9-10,14,16-18H,5-8,11-13H2,(H,37,38)
NCI pathway
Reactome pathway
n/an/an/an/a 0.200n/an/an/an/a
Genomics Institute of the Novartis Research Foundation
Curated by ChEMBL
Assay Description
Agonist activity at recombinant human GST-tagged FXR ligand binding domain (193 to 472 residues) expressed in baculovirus infected insect cells asses...
J Med Chem 60: 9960-9973 (2017)
Article DOI: 10.1021/acs.jmedchem.7b00907
BindingDB Entry DOI: 10.7270/Q2H997N6
3D
3D Structure (crystal)
Bile acid receptor
(Homo sapiens (Human))
BDBM50250860
(CHEMBL4062567)
Show SMILES OC(=O)c1cc(F)c2nc(sc2c1)N1C2CCC1CC(C2)OCc1c(onc1-c1ccccc1OC(F)(F)F)C1CC1 |THB:21:19:15.16:13|
Show InChI InChI=1S/C29H25F4N3O5S/c30-21-9-15(27(37)38)10-23-25(21)34-28(42-23)36-16-7-8-17(36)12-18(11-16)39-13-20-24(35-41-26(20)14-5-6-14)19-3-1-2-4-22(19)40-29(31,32)33/h1-4,9-10,14,16-18H,5-8,11-13H2,(H,37,38)
NCI pathway
Reactome pathway
n/an/an/an/a 0.260n/an/an/an/a
Genomics Institute of the Novartis Research Foundation
Curated by ChEMBL
Assay Description
Agonist activity at recombinant human GST-tagged FXR ligand binding domain (193 to 472 residues) expressed in baculovirus infected insect cells asses...
J Med Chem 60: 9960-9973 (2017)
Article DOI: 10.1021/acs.jmedchem.7b00907
BindingDB Entry DOI: 10.7270/Q2H997N6
3D
3D Structure (crystal)
G-protein coupled bile acid receptor 1
(Mus musculus)
BDBM50250860
(CHEMBL4062567)
Show SMILES OC(=O)c1cc(F)c2nc(sc2c1)N1C2CCC1CC(C2)OCc1c(onc1-c1ccccc1OC(F)(F)F)C1CC1 |THB:21:19:15.16:13|
Show InChI InChI=1S/C29H25F4N3O5S/c30-21-9-15(27(37)38)10-23-25(21)34-28(42-23)36-16-7-8-17(36)12-18(11-16)39-13-20-24(35-41-26(20)14-5-6-14)19-3-1-2-4-22(19)40-29(31,32)33/h1-4,9-10,14,16-18H,5-8,11-13H2,(H,37,38)
Reactome pathway
n/an/an/an/a>1.00E+4n/an/an/an/a
Genomics Institute of the Novartis Research Foundation
Curated by ChEMBL
Assay Description
Agonist activity at mouse TGR5
J Med Chem 60: 9960-9973 (2017)
Article DOI: 10.1021/acs.jmedchem.7b00907
BindingDB Entry DOI: 10.7270/Q2H997N6