BDBM50250870 CHEMBL4076774
SMILES: COc1cc(cc2sc(nc12)N1C2CCC1CC(C2)OCc1c(onc1-c1ccccc1OC(F)(F)F)C1CC1)C(O)=O
InChI Key: InChIKey=CGVCVEZDFSKMOM-UHFFFAOYSA-N
Data: 2 EC50
Activity Spreadsheet -- Enzyme Inhibition Constant Data from BindingDB
Found 2 hits for monomerid = 50250870
Trg + Lig
Ki
nM
ΔG°
kcal/mole
IC50
nM
Kd
nM
EC50/IC50
nM
koff
s-1
kon
M-1s-1
pHTemp
°C
Bile acid receptor FXR
(Homo sapiens (Human))
BDBM50250870
(CHEMBL4076774)
Show SMILES COc1cc(cc2sc(nc12)N1C2CCC1CC(C2)OCc1c(onc1-c1ccccc1OC(F)(F)F)C1CC1)C(O)=O |THB:8:11:13.14:16.17.18,19:17:11:13.14|
Show InChI InChI=1S/C30H28F3N3O6S/c1-39-23-10-16(28(37)38)11-24-26(23)34-29(43-24)36-17-8-9-18(36)13-19(12-17)40-14-21-25(35-42-27(21)15-6-7-15)20-4-2-3-5-22(20)41-30(31,32)33/h2-5,10-11,15,17-19H,6-9,12-14H2,1H3,(H,37,38)
NCI pathway
Reactome pathway
n/an/an/an/a 0.570n/an/an/an/a
Genomics Institute of the Novartis Research Foundation
Curated by ChEMBL
Assay Description
Agonist activity at recombinant human GST-tagged FXR ligand binding domain (193 to 472 residues) expressed in baculovirus infected insect cells asses...
J Med Chem 60: 9960-9973 (2017)
Article DOI: 10.1021/acs.jmedchem.7b00907
BindingDB Entry DOI: 10.7270/Q2H997N6
Bile acid receptor
(Homo sapiens (Human))
BDBM50250870
(CHEMBL4076774)
Show SMILES COc1cc(cc2sc(nc12)N1C2CCC1CC(C2)OCc1c(onc1-c1ccccc1OC(F)(F)F)C1CC1)C(O)=O |THB:8:11:13.14:16.17.18,19:17:11:13.14|
Show InChI InChI=1S/C30H28F3N3O6S/c1-39-23-10-16(28(37)38)11-24-26(23)34-29(43-24)36-17-8-9-18(36)13-19(12-17)40-14-21-25(35-42-27(21)15-6-7-15)20-4-2-3-5-22(20)41-30(31,32)33/h2-5,10-11,15,17-19H,6-9,12-14H2,1H3,(H,37,38)
NCI pathway
Reactome pathway
n/an/an/an/a 0.420n/an/an/an/a
Genomics Institute of the Novartis Research Foundation
Curated by ChEMBL
Assay Description
Agonist activity at recombinant human GST-tagged FXR ligand binding domain (193 to 472 residues) expressed in baculovirus infected insect cells asses...
J Med Chem 60: 9960-9973 (2017)
Article DOI: 10.1021/acs.jmedchem.7b00907
BindingDB Entry DOI: 10.7270/Q2H997N6