BDBM50250911 CHEMBL4095153::US10696655, Example 45
SMILES: Cn1cc(cn1)-c1cc2CCCN(c3cc(N4CCOCC4)c4n(C)c(=O)n(C)c4c3)c2cc1C(F)F
InChI Key: InChIKey=WBUKZCOFHIPRBL-UHFFFAOYSA-N
Data: 3 IC50  1 EC50
Activity Spreadsheet -- Enzyme Inhibition Constant Data from BindingDB
Found 4 hits for monomerid = 50250911
Trg + Lig
Ki
nM
ΔG°
kcal/mole
IC50
nM
Kd
nM
EC50/IC50
nM
koff
s-1
kon
M-1s-1
pHTemp
°C
CREB-binding protein
(Homo sapiens (Human))
BDBM50250911
(CHEMBL4095153 | US10696655, Example 45)
Show SMILES Cn1cc(cn1)-c1cc2CCCN(c3cc(N4CCOCC4)c4n(C)c(=O)n(C)c4c3)c2cc1C(F)F
Show InChI InChI=1S/C27H30F2N6O2/c1-31-16-18(15-30-31)20-11-17-5-4-6-35(22(17)14-21(20)26(28)29)19-12-23-25(33(3)27(36)32(23)2)24(13-19)34-7-9-37-10-8-34/h11-16,26H,4-10H2,1-3H3
Reactome pathway
n/an/a 3.60n/an/an/an/an/an/a
Genentech
Curated by ChEMBL
Assay Description
Inhibition of His tagged recombinant CBP (unknown origin) by TR-FRET assay
J Med Chem 60: 10151-10171 (2017)
Article DOI: 10.1021/acs.jmedchem.7b01372
BindingDB Entry DOI: 10.7270/Q27S7R65
CREB-binding protein
(Homo sapiens (Human))
BDBM50250911
(CHEMBL4095153 | US10696655, Example 45)
Show SMILES Cn1cc(cn1)-c1cc2CCCN(c3cc(N4CCOCC4)c4n(C)c(=O)n(C)c4c3)c2cc1C(F)F
Show InChI InChI=1S/C27H30F2N6O2/c1-31-16-18(15-30-31)20-11-17-5-4-6-35(22(17)14-21(20)26(28)29)19-12-23-25(33(3)27(36)32(23)2)24(13-19)34-7-9-37-10-8-34/h11-16,26H,4-10H2,1-3H3
Reactome pathway
US Patent
n/an/a 4n/an/an/an/an/an/a
GENENTECH, INC.; CONSTELLATION PHARMACEUTICALS, INC.
US Patent
Assay Description
His/Flag epitope tagged CBP was cloned, expressed, and purified to homogeneity. CBP binding and inhibition was assessed by monitoring the engagement ...
US Patent US10696655 (2020)
CREB-binding protein/Histone acetyltransferase p300
(Homo sapiens (Human))
BDBM50250911
(CHEMBL4095153 | US10696655, Example 45)
Show SMILES Cn1cc(cn1)-c1cc2CCCN(c3cc(N4CCOCC4)c4n(C)c(=O)n(C)c4c3)c2cc1C(F)F
Show InChI InChI=1S/C27H30F2N6O2/c1-31-16-18(15-30-31)20-11-17-5-4-6-35(22(17)14-21(20)26(28)29)19-12-23-25(33(3)27(36)32(23)2)24(13-19)34-7-9-37-10-8-34/h11-16,26H,4-10H2,1-3H3
n/an/an/an/a 12n/an/an/an/a
Genentech
Curated by ChEMBL
Assay Description
Inhibition of P300/CBP in human MV4-11 cells assessed as reduction in MYC expression after 4 hrs by luminescence based assay
J Med Chem 60: 10151-10171 (2017)
Article DOI: 10.1021/acs.jmedchem.7b01372
BindingDB Entry DOI: 10.7270/Q27S7R65
Bromodomain-containing protein 4
(Homo sapiens (Human))
BDBM50250911
(CHEMBL4095153 | US10696655, Example 45)
Show SMILES Cn1cc(cn1)-c1cc2CCCN(c3cc(N4CCOCC4)c4n(C)c(=O)n(C)c4c3)c2cc1C(F)F
Show InChI InChI=1S/C27H30F2N6O2/c1-31-16-18(15-30-31)20-11-17-5-4-6-35(22(17)14-21(20)26(28)29)19-12-23-25(33(3)27(36)32(23)2)24(13-19)34-7-9-37-10-8-34/h11-16,26H,4-10H2,1-3H3
n/an/a 1.10E+3n/an/an/an/an/an/a
Genentech
Curated by ChEMBL
Assay Description
Inhibition of His tagged recombinant BRD4 bromodomain 1 (unknown origin) by TR-FRET assay
J Med Chem 60: 10151-10171 (2017)
Article DOI: 10.1021/acs.jmedchem.7b01372
BindingDB Entry DOI: 10.7270/Q27S7R65