BDBM50251006 (2S)-Euchrenone a7::CHEMBL457686
SMILES: [#6]\[#6](-[#6])=[#6]\[#6]-c1c(-[#8])ccc2-[#6](=O)-[#6]-[#6@H](-[#8]-c12)-c1ccc(-[#8])cc1-[#8]
InChI Key: InChIKey=JJOUBYOHNYJCOU-IBGZPJMESA-N
Data: 1 IC50
Activity Spreadsheet -- Enzyme Inhibition Constant Data from BindingDB
Found 1 hit for monomerid = 50251006
Trg + Lig
Ki
nM
ΔG°
kcal/mole
IC50
nM
Kd
nM
EC50/IC50
nM
koff
s-1
kon
M-1s-1
pHTemp
°C
Cytochrome P450 19A1
(Homo sapiens (Human))
BDBM50251006
((2S)-Euchrenone a7 | CHEMBL457686)
Show SMILES [#6]\[#6](-[#6])=[#6]\[#6]-c1c(-[#8])ccc2-[#6](=O)-[#6]-[#6@H](-[#8]-c12)-c1ccc(-[#8])cc1-[#8] |r|
Show InChI InChI=1S/C20H20O5/c1-11(2)3-5-14-16(22)8-7-15-18(24)10-19(25-20(14)15)13-6-4-12(21)9-17(13)23/h3-4,6-9,19,21-23H,5,10H2,1-2H3/t19-/m0/s1
Reactome pathway
n/an/a 3.40E+3n/an/an/an/an/an/a
University of Illinois at Chicago
Curated by ChEMBL
Assay Description
Inhibition of aromatase from human placental microsomes
J Nat Prod 64: 1286-93 (2001)
BindingDB Entry DOI: 10.7270/Q2RB74C4