BDBM50251015 CHEMBL454705::albanol A
SMILES: CC1=C[C@H]2C3[C@H](C1)c1ccc(O)cc1O[C@]3(Oc1cc(cc(O)c21)-c1cc2ccc(O)cc2o1)c1ccc(O)cc1O
InChI Key: InChIKey=MJJWBJFYYRAYKU-WLKQUGLZSA-N
Data: 1 IC50
Activity Spreadsheet -- Enzyme Inhibition Constant Data from BindingDB
Found 1 hit for monomerid = 50251015
Trg + Lig
Ki
nM
ΔG°
kcal/mole
IC50
nM
Kd
nM
EC50/IC50
nM
koff
s-1
kon
M-1s-1
pHTemp
°C
Cytochrome P450 19A1
(Homo sapiens (Human))
BDBM50251015
(CHEMBL454705 | albanol A)
Show SMILES CC1=C[C@H]2C3[C@H](C1)c1ccc(O)cc1O[C@]3(Oc1cc(cc(O)c21)-c1cc2ccc(O)cc2o1)c1ccc(O)cc1O |r,t:1|
Show InChI InChI=1S/C34H26O8/c1-16-8-23-22-6-4-21(37)15-30(22)41-34(25-7-5-19(35)13-26(25)38)33(23)24(9-16)32-27(39)10-18(12-31(32)42-34)28-11-17-2-3-20(36)14-29(17)40-28/h2-7,9-15,23-24,33,35-39H,8H2,1H3/t23-,24-,33?,34+/m1/s1
Reactome pathway
n/an/a 7.50E+3n/an/an/an/an/an/a
University of Illinois at Chicago
Curated by ChEMBL
Assay Description
Inhibition of aromatase from human placental microsomes
J Nat Prod 64: 1286-93 (2001)
BindingDB Entry DOI: 10.7270/Q2RB74C4