BDBM50251324 CHEMBL4089464
SMILES: Cc1cc(=O)n(nc1C(=O)Nc1ccc(Oc2ccnc3n(C)ccc23)cc1)-c1cccc(Br)c1
InChI Key: InChIKey=DRXUGBRWMOFPNF-UHFFFAOYSA-N
Data: 1 IC50
Activity Spreadsheet -- Enzyme Inhibition Constant Data from BindingDB
Found 1 hit for monomerid = 50251324
Trg + Lig
Ki
nM
ΔG°
kcal/mole
IC50
nM
Kd
nM
EC50/IC50
nM
koff
s-1
kon
M-1s-1
pHTemp
°C
Hepatocyte growth factor receptor
(Homo sapiens (Human))
BDBM50251324
(CHEMBL4089464)
Show SMILES Cc1cc(=O)n(nc1C(=O)Nc1ccc(Oc2ccnc3n(C)ccc23)cc1)-c1cccc(Br)c1
Show InChI InChI=1S/C26H20BrN5O3/c1-16-14-23(33)32(19-5-3-4-17(27)15-19)30-24(16)26(34)29-18-6-8-20(9-7-18)35-22-10-12-28-25-21(22)11-13-31(25)2/h3-15H,1-2H3,(H,29,34)
n/an/a 10n/an/an/an/an/an/a
School of Pharmacy, Jiangxi Science and Technology Normal University, Nanchang 330013, PR China. Electronic address: tangqidongcn@126.com.
Curated by ChEMBL
Assay Description
Inhibition of c-Met (unknown origin) using poly (Glu, Tyr) 4:1 as substrate after 30 mins by HTRF assay
Eur J Med Chem 133: 97-106 (2017)
Article DOI: 10.1016/j.ejmech.2017.03.045
BindingDB Entry DOI: 10.7270/Q2K35X3B