BDBM50251620 2-(2-(isopropylamino)propan-2-yl)-1H-benzo[d]imidazole-4-carboxamide::CHEMBL479779
SMILES: CC(C)NC(C)(C)c1nc2cccc(C(N)=O)c2[nH]1
InChI Key: InChIKey=YAYSHFPAEPFXLI-UHFFFAOYSA-N
Data: 1 KI  1 EC50
Activity Spreadsheet -- Enzyme Inhibition Constant Data from BindingDB
Found 2 hits for monomerid = 50251620
Trg + Lig
Ki
nM
ΔG°
kcal/mole
IC50
nM
Kd
nM
EC50/IC50
nM
koff
s-1
kon
M-1s-1
pHTemp
°C
Poly [ADP-ribose] polymerase 1
(Homo sapiens (Human))
BDBM50251620
(2-(2-(isopropylamino)propan-2-yl)-1H-benzo[d]imida...)
Show SMILES CC(C)NC(C)(C)c1nc2cccc(C(N)=O)c2[nH]1
Show InChI InChI=1S/C14H20N4O/c1-8(2)18-14(3,4)13-16-10-7-5-6-9(12(15)19)11(10)17-13/h5-8,18H,1-4H3,(H2,15,19)(H,16,17)
7n/an/an/an/an/an/an/an/a
Abbott Laboratories
Curated by ChEMBL
Assay Description
Inhibition of PARP1 (unknown origin)
Bioorg Med Chem Lett 18: 3955-8 (2008)
Article DOI: 10.1016/j.bmcl.2008.06.023
BindingDB Entry DOI: 10.7270/Q24F1QJK
Poly [ADP-ribose] polymerase 1
(Homo sapiens (Human))
BDBM50251620
(2-(2-(isopropylamino)propan-2-yl)-1H-benzo[d]imida...)
Show SMILES CC(C)NC(C)(C)c1nc2cccc(C(N)=O)c2[nH]1
Show InChI InChI=1S/C14H20N4O/c1-8(2)18-14(3,4)13-16-10-7-5-6-9(12(15)19)11(10)17-13/h5-8,18H,1-4H3,(H2,15,19)(H,16,17)
n/an/an/an/a 2n/an/an/an/a
Abbott Laboratories
Curated by ChEMBL
Assay Description
Inhibition of PARP1 (unknown origin) in cell based assay
Bioorg Med Chem Lett 18: 3955-8 (2008)
Article DOI: 10.1016/j.bmcl.2008.06.023
BindingDB Entry DOI: 10.7270/Q24F1QJK