BDBM50251674 2-(2,6-diethylphenyl)-4-methoxy-N-o-tolyl-5,6,7,8-tetrahydroquinolin-5-amine::CHEMBL479767
SMILES: CCc1cccc(CC)c1-c1cc(OC)c2C(CCCc2n1)Nc1ccccc1C
InChI Key: InChIKey=ZNEYMKBUYJEGSJ-UHFFFAOYSA-N
Data: 1 IC50
Activity Spreadsheet -- Enzyme Inhibition Constant Data from BindingDB
Found 1 hit for monomerid = 50251674
Trg + Lig
Ki
nM
ΔG°
kcal/mole
IC50
nM
Kd
nM
EC50/IC50
nM
koff
s-1
kon
M-1s-1
pHTemp
°C
C5a anaphylatoxin chemotactic receptor (C5aR)
(Homo sapiens (Human))
BDBM50251674
(2-(2,6-diethylphenyl)-4-methoxy-N-o-tolyl-5,6,7,8-...)
Show SMILES CCc1cccc(CC)c1-c1cc(OC)c2C(CCCc2n1)Nc1ccccc1C
Show InChI InChI=1S/C27H32N2O/c1-5-19-12-9-13-20(6-2)26(19)24-17-25(30-4)27-22(15-10-16-23(27)29-24)28-21-14-8-7-11-18(21)3/h7-9,11-14,17,22,28H,5-6,10,15-16H2,1-4H3
n/an/a 910n/an/an/an/an/an/a
Johnson & Johnson Pharmaceutical Research and Development
Curated by ChEMBL
Assay Description
Antagonist activity at human recombinant C5a receptor in U937 cells assessed as inhibition of C5a-induced calcium mobilization by FLIPR assay
Bioorg Med Chem Lett 18: 3852-5 (2008)
Article DOI: 10.1016/j.bmcl.2008.06.059
BindingDB Entry DOI: 10.7270/Q2765F4X