BDBM50251711 2-(2,6-diethylphenyl)-N-(5-fluoro-2-methylphenyl)-4-methoxy-5,6,7,8-tetrahydroquinolin-5-amine::CHEMBL479391
SMILES: CCc1cccc(CC)c1-c1cc(OC)c2C(CCCc2n1)Nc1cc(F)ccc1C
InChI Key: InChIKey=WZAIWTPZFGYJLI-UHFFFAOYSA-N
Data: 1 IC50
Activity Spreadsheet -- Enzyme Inhibition Constant Data from BindingDB
Found 1 hit for monomerid = 50251711
Trg + Lig
Ki
nM
ΔG°
kcal/mole
IC50
nM
Kd
nM
EC50/IC50
nM
koff
s-1
kon
M-1s-1
pHTemp
°C
C5a anaphylatoxin chemotactic receptor (C5aR)
(Homo sapiens (Human))
BDBM50251711
(2-(2,6-diethylphenyl)-N-(5-fluoro-2-methylphenyl)-...)
Show SMILES CCc1cccc(CC)c1-c1cc(OC)c2C(CCCc2n1)Nc1cc(F)ccc1C
Show InChI InChI=1S/C27H31FN2O/c1-5-18-9-7-10-19(6-2)26(18)24-16-25(31-4)27-21(11-8-12-22(27)30-24)29-23-15-20(28)14-13-17(23)3/h7,9-10,13-16,21,29H,5-6,8,11-12H2,1-4H3
n/an/a 1.40E+3n/an/an/an/an/an/a
Johnson & Johnson Pharmaceutical Research and Development
Curated by ChEMBL
Assay Description
Antagonist activity at human recombinant C5a receptor in U937 cells assessed as inhibition of C5a-induced calcium mobilization by FLIPR assay
Bioorg Med Chem Lett 18: 3852-5 (2008)
Article DOI: 10.1016/j.bmcl.2008.06.059
BindingDB Entry DOI: 10.7270/Q2765F4X