BDBM50251871 (2-(4-methoxyphenoxy)phenyl)-N,N-dimethylmethanamine::CHEMBL474922
SMILES: COc1ccc(Oc2ccccc2CN(C)C)cc1
InChI Key: InChIKey=YZSUSCODCJEDGG-UHFFFAOYSA-N
Data: 3 IC50
Activity Spreadsheet -- Enzyme Inhibition Constant Data from BindingDB
Found 3 hits for monomerid = 50251871
Trg + Lig
Ki
nM
ΔG°
kcal/mole
IC50
nM
Kd
nM
EC50/IC50
nM
koff
s-1
kon
M-1s-1
pHTemp
°C
Sodium-dependent dopamine transporter
(Homo sapiens (Human))
BDBM50251871
((2-(4-methoxyphenoxy)phenyl)-N,N-dimethylmethanami...)
Show SMILES COc1ccc(Oc2ccccc2CN(C)C)cc1
Show InChI InChI=1S/C16H19NO2/c1-17(2)12-13-6-4-5-7-16(13)19-15-10-8-14(18-3)9-11-15/h4-11H,12H2,1-3H3
NCI pathway
Reactome pathway
n/an/a 6.40E+3n/an/an/an/an/an/a
Pfizer Global Research and Development
Curated by ChEMBL
Assay Description
Inhibition of [3H]DA reuptake at human dopamine transporter expressed in HEK293 cells
Bioorg Med Chem Lett 18: 4018-21 (2008)
Article DOI: 10.1016/j.bmcl.2008.06.001
BindingDB Entry DOI: 10.7270/Q2W37W4X
Sodium-dependent serotonin transporter
(Homo sapiens (Human))
BDBM50251871
((2-(4-methoxyphenoxy)phenyl)-N,N-dimethylmethanami...)
Show SMILES COc1ccc(Oc2ccccc2CN(C)C)cc1
Show InChI InChI=1S/C16H19NO2/c1-17(2)12-13-6-4-5-7-16(13)19-15-10-8-14(18-3)9-11-15/h4-11H,12H2,1-3H3
n/an/a 25n/an/an/an/an/an/a
Pfizer Global Research and Development
Curated by ChEMBL
Assay Description
Inhibition of [3H]5HT reuptake at human serotonin transporter expressed in HEK293 cells
Bioorg Med Chem Lett 18: 4018-21 (2008)
Article DOI: 10.1016/j.bmcl.2008.06.001
BindingDB Entry DOI: 10.7270/Q2W37W4X
Sodium-dependent noradrenaline transporter
(Homo sapiens (Human))
BDBM50251871
((2-(4-methoxyphenoxy)phenyl)-N,N-dimethylmethanami...)
Show SMILES COc1ccc(Oc2ccccc2CN(C)C)cc1
Show InChI InChI=1S/C16H19NO2/c1-17(2)12-13-6-4-5-7-16(13)19-15-10-8-14(18-3)9-11-15/h4-11H,12H2,1-3H3
Reactome pathway
n/an/a 680n/an/an/an/an/an/a
Pfizer Global Research and Development
Curated by ChEMBL
Assay Description
Inhibition of [3H]NA reuptake in human noradrenaline transporter expressed in HEK293 cells
Bioorg Med Chem Lett 18: 4018-21 (2008)
Article DOI: 10.1016/j.bmcl.2008.06.001
BindingDB Entry DOI: 10.7270/Q2W37W4X