BDBM50251953 2-(3-hydroxy-2-(2-(phenylsulfonyl)acetamido)-2,3-dihydrothiazol-4-yl)-2-methylpropanoic acid::CHEMBL479417
SMILES: CC(C)(C(O)=O)c1csc(=NC(=O)CS(=O)(=O)c2ccccc2)n1O
InChI Key: InChIKey=CJKDCLDGIPWZCM-UHFFFAOYSA-N
Data: 1 IC50
Activity Spreadsheet -- Enzyme Inhibition Constant Data from BindingDB
Found 1 hit for monomerid = 50251953
Trg + Lig
Ki
nM
ΔG°
kcal/mole
IC50
nM
Kd
nM
EC50/IC50
nM
koff
s-1
kon
M-1s-1
pHTemp
°C
Egl nine homolog 1
(Homo sapiens (Human))
BDBM50251953
(2-(3-hydroxy-2-(2-(phenylsulfonyl)acetamido)-2,3-d...)
Show SMILES CC(C)(C(O)=O)c1csc(=NC(=O)CS(=O)(=O)c2ccccc2)n1O |w:10.10|
Show InChI InChI=1S/C15H16N2O6S2/c1-15(2,13(19)20)11-8-24-14(17(11)21)16-12(18)9-25(22,23)10-6-4-3-5-7-10/h3-8,21H,9H2,1-2H3,(H,19,20)
Reactome pathway
n/an/a>4.00E+4n/an/an/an/an/an/a
Amgen, Inc.
Curated by ChEMBL
Assay Description
Inhibition of human PHD2 assesssed as hydroxylation of Pro564 in human HIF-1alpha by TR-FRET assay
Bioorg Med Chem Lett 18: 3925-8 (2008)
Article DOI: 10.1016/j.bmcl.2008.06.031
BindingDB Entry DOI: 10.7270/Q2XW4JM5