BDBM50251983 2-{4-[4-(4-Fluoro-phenyl)-2-methylsulfanyl-1H-imidazol-5-yl]-pyridin-2-ylamino}-3-methylbutan-1-ol::CHEMBL481116
SMILES: CSc1nc(c([nH]1)-c1ccc(F)cc1)-c1ccnc(NC(CO)C(C)C)c1
InChI Key: InChIKey=NIDKGCPDHANJIH-UHFFFAOYSA-N
Data: 1 IC50
Activity Spreadsheet -- Enzyme Inhibition Constant Data from BindingDB
Found 1 hit for monomerid = 50251983
Trg + Lig
Ki
nM
ΔG°
kcal/mole
IC50
nM
Kd
nM
EC50/IC50
nM
koff
s-1
kon
M-1s-1
pHTemp
°C
Mitogen-activated protein kinase 14
(Homo sapiens (Human))
BDBM50251983
(2-{4-[4-(4-Fluoro-phenyl)-2-methylsulfanyl-1H-imid...)
Show SMILES CSc1nc(c([nH]1)-c1ccc(F)cc1)-c1ccnc(NC(CO)C(C)C)c1
Show InChI InChI=1S/C20H23FN4OS/c1-12(2)16(11-26)23-17-10-14(8-9-22-17)19-18(24-20(25-19)27-3)13-4-6-15(21)7-5-13/h4-10,12,16,26H,11H2,1-3H3,(H,22,23)(H,24,25)
NCI pathway
Reactome pathway
n/an/a 34n/an/an/an/an/an/a
Eberhard-Karls-University Tuebingen
Curated by ChEMBL
Assay Description
Inhibition of p38alpha
J Med Chem 51: 4122-49 (2008)
Article DOI: 10.1021/jm701529q
BindingDB Entry DOI: 10.7270/Q2W37X67