null
SMILES: CC(C)N(c1cc(C(=O)N2CCCC2)n(C)c1)c1cc(C)cc(C)c1
InChI Key: InChIKey=QCVKIPBEESFZDR-UHFFFAOYSA-N
Activity Spreadsheet -- Enzyme Inhibition Constant Data from BindingDB
Found 2 hits for monomerid = 50252080
Trg + Lig
Ki
nM
ΔG°
kcal/mole
IC50
nM
Kd
nM
EC50/IC50
nM
koff
s-1
kon
M-1s-1
pHTemp
°C
Androgen receptor
(Homo sapiens (Human))
BDBM50252080
(CHEMBL516752 | N-[4-[(3,5-Dimethylphenyl)(iso-prop...)
Show SMILES CC(C)N(c1cc(C(=O)N2CCCC2)n(C)c1)c1cc(C)cc(C)c1
Show InChI InChI=1S/C21H29N3O/c1-15(2)24(18-11-16(3)10-17(4)12-18)19-13-20(22(5)14-19)21(25)23-8-6-7-9-23/h10-15H,6-9H2,1-5H3
NCI pathway
Reactome pathway
2.70E+3n/an/an/an/an/an/an/an/a
The University of Tokyo
Curated by ChEMBL
Assay Description
Displacement of [3H]testosterone from wild type human androgen receptor
Bioorg Med Chem 16: 6799-812 (2008)
Article DOI: 10.1016/j.bmc.2008.05.063
BindingDB Entry DOI: 10.7270/Q2MK6CPV
Androgen receptor
(Homo sapiens (Human))
BDBM50252080
(CHEMBL516752 | N-[4-[(3,5-Dimethylphenyl)(iso-prop...)
Show SMILES CC(C)N(c1cc(C(=O)N2CCCC2)n(C)c1)c1cc(C)cc(C)c1
Show InChI InChI=1S/C21H29N3O/c1-15(2)24(18-11-16(3)10-17(4)12-18)19-13-20(22(5)14-19)21(25)23-8-6-7-9-23/h10-15H,6-9H2,1-5H3
NCI pathway
Reactome pathway
n/an/a 1.00E+4n/an/an/an/an/an/a
The University of Tokyo
Curated by ChEMBL
Assay Description
Antagonist activity at wild type human recombinant androgen receptor assessed as inhibition of testosterone-induced growth of mouse androgen dependen...
Bioorg Med Chem 16: 6799-812 (2008)
Article DOI: 10.1016/j.bmc.2008.05.063
BindingDB Entry DOI: 10.7270/Q2MK6CPV