BDBM50252120 CHEMBL479783::N-(3-((dimethylamino)methyl)-4-(4-(methylthio)phenylthio)phenyl)-N-methylmethanesulfonamide
SMILES: CSc1ccc(Sc2ccc(cc2CN(C)C)N(C)S(C)(=O)=O)cc1
InChI Key: InChIKey=CCLDYFDEDOTWJF-UHFFFAOYSA-N
Data: 3 IC50
Activity Spreadsheet -- Enzyme Inhibition Constant Data from BindingDB
Found 3 hits for monomerid = 50252120
Trg + Lig
Ki
nM
ΔG°
kcal/mole
IC50
nM
Kd
nM
EC50/IC50
nM
koff
s-1
kon
M-1s-1
pHTemp
°C
Sodium-dependent serotonin transporter
(Homo sapiens (Human))
BDBM50252120
(CHEMBL479783 | N-(3-((dimethylamino)methyl)-4-(4-(...)
Show SMILES CSc1ccc(Sc2ccc(cc2CN(C)C)N(C)S(C)(=O)=O)cc1
Show InChI InChI=1S/C18H24N2O2S3/c1-19(2)13-14-12-15(20(3)25(5,21)22)6-11-18(14)24-17-9-7-16(23-4)8-10-17/h6-12H,13H2,1-5H3
n/an/a 5n/an/an/an/an/an/a
Pfizer Global Research and Development
Curated by ChEMBL
Assay Description
Inhibition of [3H]5HT reuptake at human serotonin transporter expressed in HEK293 cells
Bioorg Med Chem Lett 18: 4018-21 (2008)
Article DOI: 10.1016/j.bmcl.2008.06.001
BindingDB Entry DOI: 10.7270/Q2W37W4X
Sodium-dependent noradrenaline transporter
(Homo sapiens (Human))
BDBM50252120
(CHEMBL479783 | N-(3-((dimethylamino)methyl)-4-(4-(...)
Show SMILES CSc1ccc(Sc2ccc(cc2CN(C)C)N(C)S(C)(=O)=O)cc1
Show InChI InChI=1S/C18H24N2O2S3/c1-19(2)13-14-12-15(20(3)25(5,21)22)6-11-18(14)24-17-9-7-16(23-4)8-10-17/h6-12H,13H2,1-5H3
Reactome pathway
n/an/a 70n/an/an/an/an/an/a
Pfizer Global Research and Development
Curated by ChEMBL
Assay Description
Inhibition of [3H]NA reuptake in human noradrenaline transporter expressed in HEK293 cells
Bioorg Med Chem Lett 18: 4018-21 (2008)
Article DOI: 10.1016/j.bmcl.2008.06.001
BindingDB Entry DOI: 10.7270/Q2W37W4X
Sodium-dependent dopamine transporter
(Homo sapiens (Human))
BDBM50252120
(CHEMBL479783 | N-(3-((dimethylamino)methyl)-4-(4-(...)
Show SMILES CSc1ccc(Sc2ccc(cc2CN(C)C)N(C)S(C)(=O)=O)cc1
Show InChI InChI=1S/C18H24N2O2S3/c1-19(2)13-14-12-15(20(3)25(5,21)22)6-11-18(14)24-17-9-7-16(23-4)8-10-17/h6-12H,13H2,1-5H3
NCI pathway
Reactome pathway
n/an/a 3.60E+3n/an/an/an/an/an/a
Pfizer Global Research and Development
Curated by ChEMBL
Assay Description
Inhibition of [3H]DA reuptake at human dopamine transporter expressed in HEK293 cells
Bioorg Med Chem Lett 18: 4018-21 (2008)
Article DOI: 10.1016/j.bmcl.2008.06.001
BindingDB Entry DOI: 10.7270/Q2W37W4X