null
SMILES: Cc1cc(C)cc(c1)N(Cc1ccc(CO)cc1)c1cc(C(=O)N2CCCC2)n(C)c1
InChI Key: InChIKey=UFQDWXYZGWHYFO-UHFFFAOYSA-N
Activity Spreadsheet -- Enzyme Inhibition Constant Data from BindingDB
Found 2 hits for monomerid = 50252126
Trg + Lig
Ki
nM
ΔG°
kcal/mole
IC50
nM
Kd
nM
EC50/IC50
nM
koff
s-1
kon
M-1s-1
pHTemp
°C
Androgen receptor
(Homo sapiens (Human))
BDBM50252126
(CHEMBL481686 | N-[4-[(3,5-Dimethylphenyl)(4-hydrox...)
Show SMILES Cc1cc(C)cc(c1)N(Cc1ccc(CO)cc1)c1cc(C(=O)N2CCCC2)n(C)c1
Show InChI InChI=1S/C26H31N3O2/c1-19-12-20(2)14-23(13-19)29(16-21-6-8-22(18-30)9-7-21)24-15-25(27(3)17-24)26(31)28-10-4-5-11-28/h6-9,12-15,17,30H,4-5,10-11,16,18H2,1-3H3
NCI pathway
Reactome pathway
2.20E+3n/an/an/an/an/an/an/an/a
The University of Tokyo
Curated by ChEMBL
Assay Description
Displacement of [3H]testosterone from wild type human androgen receptor
Bioorg Med Chem 16: 6799-812 (2008)
Article DOI: 10.1016/j.bmc.2008.05.063
BindingDB Entry DOI: 10.7270/Q2MK6CPV
Androgen receptor
(Homo sapiens (Human))
BDBM50252126
(CHEMBL481686 | N-[4-[(3,5-Dimethylphenyl)(4-hydrox...)
Show SMILES Cc1cc(C)cc(c1)N(Cc1ccc(CO)cc1)c1cc(C(=O)N2CCCC2)n(C)c1
Show InChI InChI=1S/C26H31N3O2/c1-19-12-20(2)14-23(13-19)29(16-21-6-8-22(18-30)9-7-21)24-15-25(27(3)17-24)26(31)28-10-4-5-11-28/h6-9,12-15,17,30H,4-5,10-11,16,18H2,1-3H3
NCI pathway
Reactome pathway
n/an/a 5.80E+3n/an/an/an/an/an/a
The University of Tokyo
Curated by ChEMBL
Assay Description
Antagonist activity at wild type human recombinant androgen receptor assessed as inhibition of testosterone-induced growth of mouse androgen dependen...
Bioorg Med Chem 16: 6799-812 (2008)
Article DOI: 10.1016/j.bmc.2008.05.063
BindingDB Entry DOI: 10.7270/Q2MK6CPV