BDBM50252277 CHEMBL521249::N-{4-[(Benzyl)(4-trifluoromethylphenyl)amino]-1-methylpyrrole-2-carbonyl}pyrrolidine
SMILES: Cn1cc(cc1C(=O)N1CCCC1)N(Cc1ccccc1)c1ccc(cc1)C(F)(F)F
InChI Key: InChIKey=WSKLDJRIBICHHV-UHFFFAOYSA-N
Data: 1 KI  1 IC50
Activity Spreadsheet -- Enzyme Inhibition Constant Data from BindingDB
Found 2 hits for monomerid = 50252277
Trg + Lig
Ki
nM
ΔG°
kcal/mole
IC50
nM
Kd
nM
EC50/IC50
nM
koff
s-1
kon
M-1s-1
pHTemp
°C
Androgen Receptor
(Homo sapiens (Human))
BDBM50252277
(CHEMBL521249 | N-{4-[(Benzyl)(4-trifluoromethylphe...)
Show SMILES Cn1cc(cc1C(=O)N1CCCC1)N(Cc1ccccc1)c1ccc(cc1)C(F)(F)F
Show InChI InChI=1S/C24H24F3N3O/c1-28-17-21(15-22(28)23(31)29-13-5-6-14-29)30(16-18-7-3-2-4-8-18)20-11-9-19(10-12-20)24(25,26)27/h2-4,7-12,15,17H,5-6,13-14,16H2,1H3
NCI pathway
Reactome pathway
270n/an/an/an/an/an/an/an/a
The University of Tokyo
Curated by ChEMBL
Assay Description
Displacement of [3H]testosterone from wild type human androgen receptor
Bioorg Med Chem 16: 6799-812 (2008)
Article DOI: 10.1016/j.bmc.2008.05.063
BindingDB Entry DOI: 10.7270/Q2MK6CPV
Androgen Receptor
(Homo sapiens (Human))
BDBM50252277
(CHEMBL521249 | N-{4-[(Benzyl)(4-trifluoromethylphe...)
Show SMILES Cn1cc(cc1C(=O)N1CCCC1)N(Cc1ccccc1)c1ccc(cc1)C(F)(F)F
Show InChI InChI=1S/C24H24F3N3O/c1-28-17-21(15-22(28)23(31)29-13-5-6-14-29)30(16-18-7-3-2-4-8-18)20-11-9-19(10-12-20)24(25,26)27/h2-4,7-12,15,17H,5-6,13-14,16H2,1H3
NCI pathway
Reactome pathway
n/an/a 1.70E+3n/an/an/an/an/an/a
The University of Tokyo
Curated by ChEMBL
Assay Description
Antagonist activity at wild type human recombinant androgen receptor assessed as inhibition of testosterone-induced growth of mouse androgen dependen...
Bioorg Med Chem 16: 6799-812 (2008)
Article DOI: 10.1016/j.bmc.2008.05.063
BindingDB Entry DOI: 10.7270/Q2MK6CPV