null
SMILES: C(COc1ccc2nc(oc2c1)-c1cccc(NC2CCNCC2)c1)CN1CCCC1
InChI Key: InChIKey=QPRXBCGQCAEWFW-UHFFFAOYSA-N
Activity Spreadsheet -- Enzyme Inhibition Constant Data from BindingDB
Found 3 hits for monomerid = 50252306
Trg + Lig
Ki
nM
ΔG°
kcal/mole
IC50
nM
Kd
nM
EC50/IC50
nM
koff
s-1
kon
M-1s-1
pHTemp
°C
Toll-like receptor 9
(Homo sapiens (Human))
BDBM50252306
(CHEMBL4088644)
Show SMILES C(COc1ccc2nc(oc2c1)-c1cccc(NC2CCNCC2)c1)CN1CCCC1
Show InChI InChI=1S/C25H32N4O2/c1-2-14-29(13-1)15-4-16-30-22-7-8-23-24(18-22)31-25(28-23)19-5-3-6-21(17-19)27-20-9-11-26-12-10-20/h3,5-8,17-18,20,26-27H,1-2,4,9-16H2
n/an/a 308n/an/an/an/an/an/a
Department of Organic and Medicinal Chemistry, CSIR-Indian Institute of Chemical Biology, 4 Raja S. C. Mullick Road, Kolkata 700032, WB, India.
Curated by ChEMBL
Assay Description
Antagonist activity at TLR9 in human plasmacytoid dendritic cells assessed as inhibition of CpGA-induced IFN-alpha production after 18 hrs by ELISA
Eur J Med Chem 134: 334-347 (2017)
Article DOI: 10.1016/j.ejmech.2017.03.086
BindingDB Entry DOI: 10.7270/Q2057JCJ
Toll-like receptor 7
(Homo sapiens (Human))
BDBM50252306
(CHEMBL4088644)
Show SMILES C(COc1ccc2nc(oc2c1)-c1cccc(NC2CCNCC2)c1)CN1CCCC1
Show InChI InChI=1S/C25H32N4O2/c1-2-14-29(13-1)15-4-16-30-22-7-8-23-24(18-22)31-25(28-23)19-5-3-6-21(17-19)27-20-9-11-26-12-10-20/h3,5-8,17-18,20,26-27H,1-2,4,9-16H2
n/an/a 7.55E+3n/an/an/an/an/an/a
TBA
Citation and Details
Toll-like receptor 7
(Homo sapiens (Human))
BDBM50252306
(CHEMBL4088644)
Show SMILES C(COc1ccc2nc(oc2c1)-c1cccc(NC2CCNCC2)c1)CN1CCCC1
Show InChI InChI=1S/C25H32N4O2/c1-2-14-29(13-1)15-4-16-30-22-7-8-23-24(18-22)31-25(28-23)19-5-3-6-21(17-19)27-20-9-11-26-12-10-20/h3,5-8,17-18,20,26-27H,1-2,4,9-16H2
n/an/a 7.55E+3n/an/an/an/an/an/a
Department of Organic and Medicinal Chemistry, CSIR-Indian Institute of Chemical Biology, 4 Raja S. C. Mullick Road, Kolkata 700032, WB, India.
Curated by ChEMBL
Assay Description
Antagonist activity at human TLR7 expressed in HEK293 cells assessed as inhibition of CL264-induced NF-kappaB activation after 24 hrs by spectrophoto...
Eur J Med Chem 134: 334-347 (2017)
Article DOI: 10.1016/j.ejmech.2017.03.086
BindingDB Entry DOI: 10.7270/Q2057JCJ