BDBM50252637 (2-(4-chlorophenylthio)phenyl)-N,N-dimethylmethanamine::CHEMBL493058
SMILES: CN(C)Cc1ccccc1Sc1ccc(Cl)cc1
InChI Key: InChIKey=KKCKVAFKRSKQRE-UHFFFAOYSA-N
Data: 1 IC50
Activity Spreadsheet -- Enzyme Inhibition Constant Data from BindingDB
Found 1 hit for monomerid = 50252637
Trg + Lig
Ki
nM
ΔG°
kcal/mole
IC50
nM
Kd
nM
EC50/IC50
nM
koff
s-1
kon
M-1s-1
pHTemp
°C
Sodium-dependent serotonin transporter
(Homo sapiens (Human))
BDBM50252637
((2-(4-chlorophenylthio)phenyl)-N,N-dimethylmethana...)
Show SMILES CN(C)Cc1ccccc1Sc1ccc(Cl)cc1
Show InChI InChI=1S/C15H16ClNS/c1-17(2)11-12-5-3-4-6-15(12)18-14-9-7-13(16)8-10-14/h3-10H,11H2,1-2H3
n/an/a 20n/an/an/an/an/an/a
Pfizer Global Research and Development
Curated by ChEMBL
Assay Description
Inhibition of [3H]5HT reuptake at human serotonin transporter expressed in HEK293 cells
Bioorg Med Chem Lett 18: 4018-21 (2008)
Article DOI: 10.1016/j.bmcl.2008.06.001
BindingDB Entry DOI: 10.7270/Q2W37W4X