BDBM50252729 (2''Z-3''E)-6-Bromoindirubin-3''-(O-{2-[4-(2-hydroxyethyl)piperazin-1-yl]ethyl}oxime) Dihydrochloride::CHEMBL3216659::CHEMBL522503
SMILES: Cl.Cl.Brc1ccc2\C(C(=O)Nc2c1)=C1\Nc2ccccc2\C\1=N/OCCN1CCNCC1
InChI Key: InChIKey=RPWRQYOHVXHGBO-YRZTTZRYSA-N
Data: 7 IC50
Activity Spreadsheet -- Enzyme Inhibition Constant Data from BindingDB
Found 7 hits for monomerid = 50252729
Trg + Lig
Ki
nM
ΔG°
kcal/mole
IC50
nM
Kd
nM
EC50/IC50
nM
koff
s-1
kon
M-1s-1
pHTemp
°C
Cyclin-dependent kinase 1
(Homo sapiens (Human))
BDBM50252729
((2''Z-3''E)-6-Bromoindirubin-3''-(O-{2-[4-(2-hydro...)
Show SMILES Cl.Cl.Brc1ccc2\C(C(=O)Nc2c1)=C1\Nc2ccccc2\C\1=N/OCCN1CCNCC1
Show InChI InChI=1S/C24H26BrN5O3/c25-16-5-6-17-20(15-16)27-24(32)21(17)23-22(18-3-1-2-4-19(18)26-23)28-33-14-12-30-9-7-29(8-10-30)11-13-31/h1-6,15,26,31H,7-14H2,(H,27,32)/b23-21-,28-22+
Reactome pathway
n/an/a 600n/an/an/an/an/an/a
University of Athens
Curated by ChEMBL
Assay Description
Inhibition of CDK1/cyclin B
J Med Chem 51: 6421-31 (2008)
Article DOI: 10.1021/jm800648y
BindingDB Entry DOI: 10.7270/Q22808JG
Cyclin-dependent kinase 1
(Homo sapiens (Human))
BDBM50252729
((2''Z-3''E)-6-Bromoindirubin-3''-(O-{2-[4-(2-hydro...)
Show SMILES Cl.Cl.Brc1ccc2\C(C(=O)Nc2c1)=C1\Nc2ccccc2\C\1=N/OCCN1CCNCC1
Show InChI InChI=1S/C24H26BrN5O3/c25-16-5-6-17-20(15-16)27-24(32)21(17)23-22(18-3-1-2-4-19(18)26-23)28-33-14-12-30-9-7-29(8-10-30)11-13-31/h1-6,15,26,31H,7-14H2,(H,27,32)/b23-21-,28-22+
Reactome pathway
n/an/a 200n/an/an/an/an/an/a
University of Athens
Curated by ChEMBL
Assay Description
Inhibition of CDK1/cyclin B
J Med Chem 51: 6421-31 (2008)
Article DOI: 10.1021/jm800648y
BindingDB Entry DOI: 10.7270/Q22808JG
Tyrosine-protein kinase ABL1
(Homo sapiens (Human))
BDBM50252729
((2''Z-3''E)-6-Bromoindirubin-3''-(O-{2-[4-(2-hydro...)
Show SMILES Cl.Cl.Brc1ccc2\C(C(=O)Nc2c1)=C1\Nc2ccccc2\C\1=N/OCCN1CCNCC1
Show InChI InChI=1S/C24H26BrN5O3/c25-16-5-6-17-20(15-16)27-24(32)21(17)23-22(18-3-1-2-4-19(18)26-23)28-33-14-12-30-9-7-29(8-10-30)11-13-31/h1-6,15,26,31H,7-14H2,(H,27,32)/b23-21-,28-22+
Reactome pathway
n/an/a 0.870n/an/an/an/an/an/a
Beckman Research Institute
Curated by ChEMBL
Assay Description
Inhibition of recombinant ABL1 (unknown origin) after 120 mins in presence of [33P]ATP
J Nat Prod 79: 2464-2471 (2016)
Article DOI: 10.1021/acs.jnatprod.6b00285
BindingDB Entry DOI: 10.7270/Q2GF0WZR
Tyrosine-protein kinase ABL1
(Homo sapiens (Human))
BDBM50252729
((2''Z-3''E)-6-Bromoindirubin-3''-(O-{2-[4-(2-hydro...)
Show SMILES Cl.Cl.Brc1ccc2\C(C(=O)Nc2c1)=C1\Nc2ccccc2\C\1=N/OCCN1CCNCC1
Show InChI InChI=1S/C24H26BrN5O3/c25-16-5-6-17-20(15-16)27-24(32)21(17)23-22(18-3-1-2-4-19(18)26-23)28-33-14-12-30-9-7-29(8-10-30)11-13-31/h1-6,15,26,31H,7-14H2,(H,27,32)/b23-21-,28-22+
Reactome pathway
n/an/a 9.40n/an/an/an/an/an/a
Beckman Research Institute
Curated by ChEMBL
Assay Description
Inhibition of recombinant ABL1 T315I mutant (unknown origin) after 120 mins in presence of [33P]ATP
J Nat Prod 79: 2464-2471 (2016)
Article DOI: 10.1021/acs.jnatprod.6b00285
BindingDB Entry DOI: 10.7270/Q2GF0WZR
Proto-oncogene tyrosine-protein kinase Src
(Homo sapiens (Human))
BDBM50252729
((2''Z-3''E)-6-Bromoindirubin-3''-(O-{2-[4-(2-hydro...)
Show SMILES Cl.Cl.Brc1ccc2\C(C(=O)Nc2c1)=C1\Nc2ccccc2\C\1=N/OCCN1CCNCC1
Show InChI InChI=1S/C24H26BrN5O3/c25-16-5-6-17-20(15-16)27-24(32)21(17)23-22(18-3-1-2-4-19(18)26-23)28-33-14-12-30-9-7-29(8-10-30)11-13-31/h1-6,15,26,31H,7-14H2,(H,27,32)/b23-21-,28-22+
n/an/a<0.5n/an/an/an/an/an/a
Beckman Research Institute
Curated by ChEMBL
Assay Description
Inhibition of recombinant c-Src (unknown origin) after 120 mins in presence of [33P]ATP
J Nat Prod 79: 2464-2471 (2016)
Article DOI: 10.1021/acs.jnatprod.6b00285
BindingDB Entry DOI: 10.7270/Q2GF0WZR
Tyrosine-protein kinase JAK2
(Homo sapiens (Human))
BDBM50252729
((2''Z-3''E)-6-Bromoindirubin-3''-(O-{2-[4-(2-hydro...)
Show SMILES Cl.Cl.Brc1ccc2\C(C(=O)Nc2c1)=C1\Nc2ccccc2\C\1=N/OCCN1CCNCC1
Show InChI InChI=1S/C24H26BrN5O3/c25-16-5-6-17-20(15-16)27-24(32)21(17)23-22(18-3-1-2-4-19(18)26-23)28-33-14-12-30-9-7-29(8-10-30)11-13-31/h1-6,15,26,31H,7-14H2,(H,27,32)/b23-21-,28-22+
Reactome pathway
n/an/a 224n/an/an/an/an/an/a
Beckman Research Institute
Curated by ChEMBL
Assay Description
Inhibition of recombinant JAK2 (unknown origin) after 120 mins in presence of [33P]ATP
J Nat Prod 79: 2464-2471 (2016)
Article DOI: 10.1021/acs.jnatprod.6b00285
BindingDB Entry DOI: 10.7270/Q2GF0WZR
Aurora kinase A
(Homo sapiens (Human))
BDBM50252729
((2''Z-3''E)-6-Bromoindirubin-3''-(O-{2-[4-(2-hydro...)
Show SMILES Cl.Cl.Brc1ccc2\C(C(=O)Nc2c1)=C1\Nc2ccccc2\C\1=N/OCCN1CCNCC1
Show InChI InChI=1S/C24H26BrN5O3/c25-16-5-6-17-20(15-16)27-24(32)21(17)23-22(18-3-1-2-4-19(18)26-23)28-33-14-12-30-9-7-29(8-10-30)11-13-31/h1-6,15,26,31H,7-14H2,(H,27,32)/b23-21-,28-22+
NCI pathway
Reactome pathway
n/an/a 7.10n/an/an/an/an/an/a
Beckman Research Institute
Curated by ChEMBL
Assay Description
Inhibition of recombinant Aurora A (unknown origin) after 120 mins in presence of [33P]ATP
J Nat Prod 79: 2464-2471 (2016)
Article DOI: 10.1021/acs.jnatprod.6b00285
BindingDB Entry DOI: 10.7270/Q2GF0WZR