BDBM50252775 6-(3-(cyclopropylamino)-6-methylbenzo[d]isoxazol-7-yl)-N-isopropylphthalazin-1-amine::CHEMBL495492
SMILES: CC(C)Nc1nncc2cc(ccc12)-c1c(C)ccc2c(NC3CC3)noc12
InChI Key: InChIKey=DYSGCGRDHIJLBK-UHFFFAOYSA-N
Data: 1 KI  2 IC50
Activity Spreadsheet -- Enzyme Inhibition Constant Data from BindingDB
Found 3 hits for monomerid = 50252775
Trg + Lig
Ki
nM
ΔG°
kcal/mole
IC50
nM
Kd
nM
EC50/IC50
nM
koff
s-1
kon
M-1s-1
pHTemp
°C
Mitogen-activated protein kinase 14
(Homo sapiens (Human))
BDBM50252775
(6-(3-(cyclopropylamino)-6-methylbenzo[d]isoxazol-7...)
Show SMILES CC(C)Nc1nncc2cc(ccc12)-c1c(C)ccc2c(NC3CC3)noc12
Show InChI InChI=1S/C22H23N5O/c1-12(2)24-21-17-9-5-14(10-15(17)11-23-26-21)19-13(3)4-8-18-20(19)28-27-22(18)25-16-6-7-16/h4-5,8-12,16H,6-7H2,1-3H3,(H,24,26)(H,25,27)
NCI pathway
Reactome pathway
0.5n/an/an/an/an/an/an/an/a
Amgen Inc.
Curated by ChEMBL
Assay Description
Inhibition of human recombinant GST-tagged p38alphaMAPK-induced ATF2 phosphorylation
J Med Chem 51: 6280-92 (2008)
Article DOI: 10.1021/jm8005405
BindingDB Entry DOI: 10.7270/Q218369B
Cytochrome P450 2D6
(Homo sapiens (Human))
BDBM50252775
(6-(3-(cyclopropylamino)-6-methylbenzo[d]isoxazol-7...)
Show SMILES CC(C)Nc1nncc2cc(ccc12)-c1c(C)ccc2c(NC3CC3)noc12
Show InChI InChI=1S/C22H23N5O/c1-12(2)24-21-17-9-5-14(10-15(17)11-23-26-21)19-13(3)4-8-18-20(19)28-27-22(18)25-16-6-7-16/h4-5,8-12,16H,6-7H2,1-3H3,(H,24,26)(H,25,27)
n/an/a>2.50E+4n/an/an/an/an/an/a
Amgen Inc.
Curated by ChEMBL
Assay Description
Inhibition of CYP2D6 (unknown origin)
J Med Chem 51: 6280-92 (2008)
Article DOI: 10.1021/jm8005405
BindingDB Entry DOI: 10.7270/Q218369B
Cytochrome P450 3A4
(Homo sapiens (Human))
BDBM50252775
(6-(3-(cyclopropylamino)-6-methylbenzo[d]isoxazol-7...)
Show SMILES CC(C)Nc1nncc2cc(ccc12)-c1c(C)ccc2c(NC3CC3)noc12
Show InChI InChI=1S/C22H23N5O/c1-12(2)24-21-17-9-5-14(10-15(17)11-23-26-21)19-13(3)4-8-18-20(19)28-27-22(18)25-16-6-7-16/h4-5,8-12,16H,6-7H2,1-3H3,(H,24,26)(H,25,27)
Reactome pathway
n/an/a 5.60E+3n/an/an/an/an/an/a
Amgen Inc.
Curated by ChEMBL
Assay Description
Inhibition of CYP3A4 in human liver microsomes
J Med Chem 51: 6280-92 (2008)
Article DOI: 10.1021/jm8005405
BindingDB Entry DOI: 10.7270/Q218369B