BDBM50252854 2-[(Butyl{4-[2,2,2-trifluoro-1-hydroxy-1-(trifluoromethyl)ethyl]phenyl}amino)methyl]-6-fluorophenol::CHEMBL522159
SMILES: CCCCN(Cc1cccc(F)c1O)c1ccc(cc1)C(O)(C(F)(F)F)C(F)(F)F
InChI Key: InChIKey=UKJHXWDCHRPIEJ-UHFFFAOYSA-N
Data: 2 IC50
Activity Spreadsheet -- Enzyme Inhibition Constant Data from BindingDB
Found 2 hits for monomerid = 50252854
Trg + Lig
Ki
nM
ΔG°
kcal/mole
IC50
nM
Kd
nM
EC50/IC50
nM
koff
s-1
kon
M-1s-1
pHTemp
°C
Oxysterols receptor LXR-alpha
(Homo sapiens (Human))
BDBM50252854
(2-[(Butyl{4-[2,2,2-trifluoro-1-hydroxy-1-(trifluor...)
Show SMILES CCCCN(Cc1cccc(F)c1O)c1ccc(cc1)C(O)(C(F)(F)F)C(F)(F)F
Show InChI InChI=1S/C20H20F7NO2/c1-2-3-11-28(12-13-5-4-6-16(21)17(13)29)15-9-7-14(8-10-15)18(30,19(22,23)24)20(25,26)27/h4-10,29-30H,2-3,11-12H2,1H3
n/an/a 615n/an/an/an/an/an/a
GlaxoSmithKline Research and Development
Curated by ChEMBL
Assay Description
Displacement of [N-methyl-3H]GW0438 from human biotinylated LXRalpha ligand binding domain
J Med Chem 51: 5758-65 (2008)
Article DOI: 10.1021/jm800612u
BindingDB Entry DOI: 10.7270/Q28052FN
Oxysterols receptor LXR-beta
(Homo sapiens (Human))
BDBM50252854
(2-[(Butyl{4-[2,2,2-trifluoro-1-hydroxy-1-(trifluor...)
Show SMILES CCCCN(Cc1cccc(F)c1O)c1ccc(cc1)C(O)(C(F)(F)F)C(F)(F)F
Show InChI InChI=1S/C20H20F7NO2/c1-2-3-11-28(12-13-5-4-6-16(21)17(13)29)15-9-7-14(8-10-15)18(30,19(22,23)24)20(25,26)27/h4-10,29-30H,2-3,11-12H2,1H3
n/an/a 120n/an/an/an/an/an/a
GlaxoSmithKline Research and Development
Curated by ChEMBL
Assay Description
Displacement of [N-methyl-3H]GW0438 from human biotinylated LXRbeta ligand binding domain
J Med Chem 51: 5758-65 (2008)
Article DOI: 10.1021/jm800612u
BindingDB Entry DOI: 10.7270/Q28052FN