BDBM50253102 6-Methyl-7-(1-((S)-3-methylmorpholino)phthalazin-6-yl)benzo[d]isoxazol-3-amine::CHEMBL494916
SMILES: C[C@H]1COCCN1c1nncc2cc(ccc12)-c1c(C)ccc2c(N)noc12
InChI Key: InChIKey=HLWJGXQCGMRQQG-ZDUSSCGKSA-N
Data: 1 KI  1 IC50
Activity Spreadsheet -- Enzyme Inhibition Constant Data from BindingDB
Found 2 hits for monomerid = 50253102
Trg + Lig
Ki
nM
ΔG°
kcal/mole
IC50
nM
Kd
nM
EC50/IC50
nM
koff
s-1
kon
M-1s-1
pHTemp
°C
Mitogen-activated protein kinase 14
(Homo sapiens (Human))
BDBM50253102
(6-Methyl-7-(1-((S)-3-methylmorpholino)phthalazin-6...)
Show SMILES C[C@H]1COCCN1c1nncc2cc(ccc12)-c1c(C)ccc2c(N)noc12 |r|
Show InChI InChI=1S/C21H21N5O2/c1-12-3-5-17-19(28-25-20(17)22)18(12)14-4-6-16-15(9-14)10-23-24-21(16)26-7-8-27-11-13(26)2/h3-6,9-10,13H,7-8,11H2,1-2H3,(H2,22,25)/t13-/m0/s1
NCI pathway
Reactome pathway
0.300n/an/an/an/an/an/an/an/a
Amgen Inc.
Curated by ChEMBL
Assay Description
Inhibition of human recombinant GST-tagged p38alphaMAPK-induced ATF2 phosphorylation
J Med Chem 51: 6280-92 (2008)
Article DOI: 10.1021/jm8005405
BindingDB Entry DOI: 10.7270/Q218369B
Cytochrome P450 3A4
(Homo sapiens (Human))
BDBM50253102
(6-Methyl-7-(1-((S)-3-methylmorpholino)phthalazin-6...)
Show SMILES C[C@H]1COCCN1c1nncc2cc(ccc12)-c1c(C)ccc2c(N)noc12 |r|
Show InChI InChI=1S/C21H21N5O2/c1-12-3-5-17-19(28-25-20(17)22)18(12)14-4-6-16-15(9-14)10-23-24-21(16)26-7-8-27-11-13(26)2/h3-6,9-10,13H,7-8,11H2,1-2H3,(H2,22,25)/t13-/m0/s1
Reactome pathway
n/an/a 1.20E+4n/an/an/an/an/an/a
Amgen Inc.
Curated by ChEMBL
Assay Description
Inhibition of CYP3A4 in human liver microsomes
J Med Chem 51: 6280-92 (2008)
Article DOI: 10.1021/jm8005405
BindingDB Entry DOI: 10.7270/Q218369B