BDBM50253119 3alpha,24,29-Trihydroxyolean-12-en-28-oic acid::CHEMBL492675
SMILES: C[C@@]1(CO)CC[C@@]2(CC[C@]3(C)C(=CC[C@@H]4[C@@]5(C)CC[C@@H](O)[C@](C)(CO)[C@@H]5CC[C@@]34C)[C@@H]2C1)C(O)=O
InChI Key: InChIKey=LQETVSULLNKTKF-YSKPPUCTSA-N
Data: 1 IC50
Activity Spreadsheet -- Enzyme Inhibition Constant Data from BindingDB
Found 1 hit for monomerid = 50253119
Trg + Lig
Ki
nM
ΔG°
kcal/mole
IC50
nM
Kd
nM
EC50/IC50
nM
koff
s-1
kon
M-1s-1
pHTemp
°C
Protein-tyrosine phosphatase 1B
(Homo sapiens (Human))
BDBM50253119
(3alpha,24,29-Trihydroxyolean-12-en-28-oic acid | C...)
Show SMILES C[C@@]1(CO)CC[C@@]2(CC[C@]3(C)C(=CC[C@@H]4[C@@]5(C)CC[C@@H](O)[C@](C)(CO)[C@@H]5CC[C@@]34C)[C@@H]2C1)C(O)=O |r,c:11|
Show InChI InChI=1S/C30H48O5/c1-25(17-31)12-14-30(24(34)35)15-13-28(4)19(20(30)16-25)6-7-22-26(2)10-9-23(33)27(3,18-32)21(26)8-11-29(22,28)5/h6,20-23,31-33H,7-18H2,1-5H3,(H,34,35)/t20-,21+,22+,23+,25+,26-,27+,28+,29+,30-/m0/s1
NCI pathway
Reactome pathway
n/an/a>3.00E+4n/an/an/an/an/an/a
Chosun University
Curated by ChEMBL
Assay Description
Inhibition of human recombinant PTP1B after 30 mins
J Nat Prod 71: 1775-8 (2008)
Article DOI: 10.1021/np800298w
BindingDB Entry DOI: 10.7270/Q2TQ62F7