null
SMILES: C[C@H](N1CC[C@@](CCCO)(OC1=O)c1ccccc1)c1ccc(cc1)-c1ccncc1
InChI Key: InChIKey=BDJBAMOTTYYCEK-RXFWQSSRSA-N
Activity Spreadsheet -- Enzyme Inhibition Constant Data from BindingDB
Found 3 hits for monomerid = 50253406
Trg + Lig
Ki
nM
ΔG°
kcal/mole
IC50
nM
Kd
nM
EC50/IC50
nM
koff
s-1
kon
M-1s-1
pHTemp
°C
Cytochrome P450 3A4
(Homo sapiens (Human))
BDBM50253406
(CHEMBL4101787)
Show SMILES C[C@H](N1CC[C@@](CCCO)(OC1=O)c1ccccc1)c1ccc(cc1)-c1ccncc1 |r|
Show InChI InChI=1S/C26H28N2O3/c1-20(21-8-10-22(11-9-21)23-12-16-27-17-13-23)28-18-15-26(14-5-19-29,31-25(28)30)24-6-3-2-4-7-24/h2-4,6-13,16-17,20,29H,5,14-15,18-19H2,1H3/t20-,26+/m0/s1
Reactome pathway
n/an/a 1.80E+3n/an/an/an/an/an/a
Medicinal Chemistry, Vitae Pharmaceuticals, Inc, 502 West Office Center Drive, Fort Washington, PA 19034, United States. Electronic address: linghang_zhuang@yahoo.com.
Curated by ChEMBL
Assay Description
Inhibition of recombinant CYP3A4 (unknown origin)
Bioorg Med Chem 25: 3649-3657 (2017)
Article DOI: 10.1016/j.bmc.2017.04.033
BindingDB Entry DOI: 10.7270/Q2KS6V0F
11-beta-hydroxysteroid dehydrogenase 1
(Homo sapiens (Human))
BDBM50253406
(CHEMBL4101787)
Show SMILES C[C@H](N1CC[C@@](CCCO)(OC1=O)c1ccccc1)c1ccc(cc1)-c1ccncc1 |r|
Show InChI InChI=1S/C26H28N2O3/c1-20(21-8-10-22(11-9-21)23-12-16-27-17-13-23)28-18-15-26(14-5-19-29,31-25(28)30)24-6-3-2-4-7-24/h2-4,6-13,16-17,20,29H,5,14-15,18-19H2,1H3/t20-,26+/m0/s1
Reactome pathway
n/an/a 0.600n/an/an/an/an/an/a
Medicinal Chemistry, Vitae Pharmaceuticals, Inc, 502 West Office Center Drive, Fort Washington, PA 19034, United States. Electronic address: linghang_zhuang@yahoo.com.
Curated by ChEMBL
Assay Description
Inhibition of human 11beta-HSD1 expressed in CHO cell microsomes using [3H]cortisone as substrate preincubated with substrate for 10 mins followed by...
Bioorg Med Chem 25: 3649-3657 (2017)
Article DOI: 10.1016/j.bmc.2017.04.033
BindingDB Entry DOI: 10.7270/Q2KS6V0F
11-beta-hydroxysteroid dehydrogenase 1
(Homo sapiens (Human))
BDBM50253406
(CHEMBL4101787)
Show SMILES C[C@H](N1CC[C@@](CCCO)(OC1=O)c1ccccc1)c1ccc(cc1)-c1ccncc1 |r|
Show InChI InChI=1S/C26H28N2O3/c1-20(21-8-10-22(11-9-21)23-12-16-27-17-13-23)28-18-15-26(14-5-19-29,31-25(28)30)24-6-3-2-4-7-24/h2-4,6-13,16-17,20,29H,5,14-15,18-19H2,1H3/t20-,26+/m0/s1
Reactome pathway
n/an/a 0.400n/an/an/an/an/an/a
Medicinal Chemistry, Vitae Pharmaceuticals, Inc, 502 West Office Center Drive, Fort Washington, PA 19034, United States. Electronic address: linghang_zhuang@yahoo.com.
Curated by ChEMBL
Assay Description
Inhibition of 11beta-HSD1 in human omental adipocytes using [3H]cortisone as substrate preincubated for 1 hr followed by substrate addition measured ...
Bioorg Med Chem 25: 3649-3657 (2017)
Article DOI: 10.1016/j.bmc.2017.04.033
BindingDB Entry DOI: 10.7270/Q2KS6V0F