BDBM50253701 CHEMBL4073971
SMILES: Cc1n[nH]cc1-c1cc2nc(CCN3CCCC3)[nH]c(=O)c2s1
InChI Key: InChIKey=OAULMYPUJIIBNW-UHFFFAOYSA-N
Data: 3 IC50
Activity Spreadsheet -- Enzyme Inhibition Constant Data from BindingDB
Found 3 hits for monomerid = 50253701
Trg + Lig
Ki
nM
ΔG°
kcal/mole
IC50
nM
Kd
nM
EC50/IC50
nM
koff
s-1
kon
M-1s-1
pHTemp
°C
Rho-associated protein kinase 1
(Homo sapiens (Human))
BDBM50253701
(CHEMBL4073971)
Show SMILES Cc1n[nH]cc1-c1cc2nc(CCN3CCCC3)[nH]c(=O)c2s1
Show InChI InChI=1S/C16H19N5OS/c1-10-11(9-17-20-10)13-8-12-15(23-13)16(22)19-14(18-12)4-7-21-5-2-3-6-21/h8-9H,2-7H2,1H3,(H,17,20)(H,18,19,22)
NCI pathway
Reactome pathway
n/an/a 1.60E+3n/an/an/an/an/an/a
Takeda Pharmaceutical Company, Ltd.
Curated by ChEMBL
Assay Description
Inhibition of recombinant human N-terminal GST-tagged ROCK1 catalytic domain (1 to 477 residues) expressed in baculovirus expression system using Bio...
Bioorg Med Chem 25: 3658-3670 (2017)
Article DOI: 10.1016/j.bmc.2017.04.044
BindingDB Entry DOI: 10.7270/Q26H4KTZ
CDC7 and DBF4
(Homo sapiens (Human))
BDBM50253701
(CHEMBL4073971)
Show SMILES Cc1n[nH]cc1-c1cc2nc(CCN3CCCC3)[nH]c(=O)c2s1
Show InChI InChI=1S/C16H19N5OS/c1-10-11(9-17-20-10)13-8-12-15(23-13)16(22)19-14(18-12)4-7-21-5-2-3-6-21/h8-9H,2-7H2,1H3,(H,17,20)(H,18,19,22)
n/an/a 140n/an/an/an/an/an/a
Takeda Pharmaceutical Company, Ltd.
Curated by ChEMBL
Assay Description
Inhibition of recombinant human full length Cdc7 (1 to 574 residues)/human N-terminal GST-tagged ASK (1 to 674 residues) expressed in baculovirus exp...
Bioorg Med Chem 25: 3658-3670 (2017)
Article DOI: 10.1016/j.bmc.2017.04.044
BindingDB Entry DOI: 10.7270/Q26H4KTZ
CDK2/CycE
(Homo sapiens (Human))
BDBM50253701
(CHEMBL4073971)
Show SMILES Cc1n[nH]cc1-c1cc2nc(CCN3CCCC3)[nH]c(=O)c2s1
Show InChI InChI=1S/C16H19N5OS/c1-10-11(9-17-20-10)13-8-12-15(23-13)16(22)19-14(18-12)4-7-21-5-2-3-6-21/h8-9H,2-7H2,1H3,(H,17,20)(H,18,19,22)
n/an/a>1.00E+4n/an/an/an/an/an/a
Takeda Pharmaceutical Company, Ltd.
Curated by ChEMBL
Assay Description
Inhibition of full length human CDC2 (1 to 298 residues)/human N-terminal GST-tagged CyclinE1 (1 to 410 residues) expressed in baculovirus expression...
Bioorg Med Chem 25: 3658-3670 (2017)
Article DOI: 10.1016/j.bmc.2017.04.044
BindingDB Entry DOI: 10.7270/Q26H4KTZ