BDBM50253709 CHEMBL461860::Phenyl-[4-(1-[1,2,4]triazol-1-yl-ethyl)-phenyl]-amine
SMILES: CC(c1ccc(Nc2ccccc2)cc1)n1cncn1
InChI Key: InChIKey=DMROGQANENHCJE-UHFFFAOYSA-N
Data: 1 IC50
Activity Spreadsheet -- Enzyme Inhibition Constant Data from BindingDB
Found 1 hit for monomerid = 50253709
Trg + Lig
Ki
nM
ΔG°
kcal/mole
IC50
nM
Kd
nM
EC50/IC50
nM
koff
s-1
kon
M-1s-1
pHTemp
°C
Cytochrome CYP26A1
(Homo sapiens (Human))
BDBM50253709
(CHEMBL461860 | Phenyl-[4-(1-[1,2,4]triazol-1-yl-et...)
Show SMILES CC(c1ccc(Nc2ccccc2)cc1)n1cncn1
Show InChI InChI=1S/C16H16N4/c1-13(20-12-17-11-18-20)14-7-9-16(10-8-14)19-15-5-3-2-4-6-15/h2-13,19H,1H3
Reactome pathway
n/an/a>5.00E+4n/an/an/an/an/an/a
Cardiff University
Curated by ChEMBL
Assay Description
Inhibition of CYP26A1 in human MCF7 cells
Bioorg Med Chem 16: 8301-13 (2008)
Article DOI: 10.1016/j.bmc.2007.06.048
BindingDB Entry DOI: 10.7270/Q2M61M5B