BDBM50253736 CHEMBL506272::N-((R)-3-(4-Fluorophenyl)-1-((S)-4-((S)-1-(methylamino)-3-(naphthalen-2-yl)-1-oxopropan-2-yl)-3-oxo-2-propylpiperazin-1-yl)-1-oxopropan-2-yl)-5-oxopyrrolidine-2-carboxamide
SMILES: CCC[C@@H]1N(CCN([C@@H](Cc2ccc3ccccc3c2)C(=O)NC)C1=O)C(=O)[C@@H](Cc1ccc(F)cc1)NC(=O)C1CCC(=O)N1
InChI Key: InChIKey=NSBYFZXDVSHNEF-WDSZSSPESA-N
Data: 3 KI  3 EC50
Activity Spreadsheet -- Enzyme Inhibition Constant Data from BindingDB
Found 6 hits for monomerid = 50253736
Trg + Lig
Ki
nM
ΔG°
kcal/mole
IC50
nM
Kd
nM
EC50/IC50
nM
koff
s-1
kon
M-1s-1
pHTemp
°C
Melanocortin receptor 4
(Homo sapiens (Human))
BDBM50253736
(CHEMBL506272 | N-((R)-3-(4-Fluorophenyl)-1-((S)-4-...)
Show SMILES CCC[C@@H]1N(CCN([C@@H](Cc2ccc3ccccc3c2)C(=O)NC)C1=O)C(=O)[C@@H](Cc1ccc(F)cc1)NC(=O)C1CCC(=O)N1 |r|
Show InChI InChI=1S/C35H40FN5O5/c1-3-6-29-35(46)41(30(33(44)37-2)21-23-9-12-24-7-4-5-8-25(24)19-23)18-17-40(29)34(45)28(20-22-10-13-26(36)14-11-22)39-32(43)27-15-16-31(42)38-27/h4-5,7-14,19,27-30H,3,6,15-18,20-21H2,1-2H3,(H,37,44)(H,38,42)(H,39,43)/t27?,28-,29+,30+/m1/s1
4n/an/an/an/an/an/an/an/a
Procter & Gamble Pharmaceuticals
Curated by ChEMBL
Assay Description
Displacement of europium-labeled NDP-alpha-MSH from human MC4R expressed in HEK293 cells
J Med Chem 51: 6055-66 (2008)
Article DOI: 10.1021/jm800525p
BindingDB Entry DOI: 10.7270/Q2DV1JQC
Melanocortin receptor 3
(Homo sapiens (Human))
BDBM50253736
(CHEMBL506272 | N-((R)-3-(4-Fluorophenyl)-1-((S)-4-...)
Show SMILES CCC[C@@H]1N(CCN([C@@H](Cc2ccc3ccccc3c2)C(=O)NC)C1=O)C(=O)[C@@H](Cc1ccc(F)cc1)NC(=O)C1CCC(=O)N1 |r|
Show InChI InChI=1S/C35H40FN5O5/c1-3-6-29-35(46)41(30(33(44)37-2)21-23-9-12-24-7-4-5-8-25(24)19-23)18-17-40(29)34(45)28(20-22-10-13-26(36)14-11-22)39-32(43)27-15-16-31(42)38-27/h4-5,7-14,19,27-30H,3,6,15-18,20-21H2,1-2H3,(H,37,44)(H,38,42)(H,39,43)/t27?,28-,29+,30+/m1/s1
128n/an/an/an/an/an/an/an/a
Procter & Gamble Pharmaceuticals
Curated by ChEMBL
Assay Description
Displacement of europium-labeled NDP-alpha-MSH from human MC3R expressed in HEK293 cells
J Med Chem 51: 6055-66 (2008)
Article DOI: 10.1021/jm800525p
BindingDB Entry DOI: 10.7270/Q2DV1JQC
Melanocyte-stimulating hormone receptor
(Homo sapiens (Human))
BDBM50253736
(CHEMBL506272 | N-((R)-3-(4-Fluorophenyl)-1-((S)-4-...)
Show SMILES CCC[C@@H]1N(CCN([C@@H](Cc2ccc3ccccc3c2)C(=O)NC)C1=O)C(=O)[C@@H](Cc1ccc(F)cc1)NC(=O)C1CCC(=O)N1 |r|
Show InChI InChI=1S/C35H40FN5O5/c1-3-6-29-35(46)41(30(33(44)37-2)21-23-9-12-24-7-4-5-8-25(24)19-23)18-17-40(29)34(45)28(20-22-10-13-26(36)14-11-22)39-32(43)27-15-16-31(42)38-27/h4-5,7-14,19,27-30H,3,6,15-18,20-21H2,1-2H3,(H,37,44)(H,38,42)(H,39,43)/t27?,28-,29+,30+/m1/s1
361n/an/an/an/an/an/an/an/a
Procter & Gamble Pharmaceuticals
Curated by ChEMBL
Assay Description
Agonist activity at human MC1R expressed in HEK293 cells assessed as effect on CRE-driven luminescence by luciferase reporter gene assay
J Med Chem 51: 6055-66 (2008)
Article DOI: 10.1021/jm800525p
BindingDB Entry DOI: 10.7270/Q2DV1JQC
Melanocortin receptor 4
(Homo sapiens (Human))
BDBM50253736
(CHEMBL506272 | N-((R)-3-(4-Fluorophenyl)-1-((S)-4-...)
Show SMILES CCC[C@@H]1N(CCN([C@@H](Cc2ccc3ccccc3c2)C(=O)NC)C1=O)C(=O)[C@@H](Cc1ccc(F)cc1)NC(=O)C1CCC(=O)N1 |r|
Show InChI InChI=1S/C35H40FN5O5/c1-3-6-29-35(46)41(30(33(44)37-2)21-23-9-12-24-7-4-5-8-25(24)19-23)18-17-40(29)34(45)28(20-22-10-13-26(36)14-11-22)39-32(43)27-15-16-31(42)38-27/h4-5,7-14,19,27-30H,3,6,15-18,20-21H2,1-2H3,(H,37,44)(H,38,42)(H,39,43)/t27?,28-,29+,30+/m1/s1
n/an/an/an/a 2n/an/an/an/a
Procter & Gamble Pharmaceuticals
Curated by ChEMBL
Assay Description
Agonist activity at human MC4R expressed in HEK293 cells assessed as effect on CRE-driven luminescence by luciferase reporter gene assay
J Med Chem 51: 6055-66 (2008)
Article DOI: 10.1021/jm800525p
BindingDB Entry DOI: 10.7270/Q2DV1JQC
Melanocyte-stimulating hormone receptor
(Homo sapiens (Human))
BDBM50253736
(CHEMBL506272 | N-((R)-3-(4-Fluorophenyl)-1-((S)-4-...)
Show SMILES CCC[C@@H]1N(CCN([C@@H](Cc2ccc3ccccc3c2)C(=O)NC)C1=O)C(=O)[C@@H](Cc1ccc(F)cc1)NC(=O)C1CCC(=O)N1 |r|
Show InChI InChI=1S/C35H40FN5O5/c1-3-6-29-35(46)41(30(33(44)37-2)21-23-9-12-24-7-4-5-8-25(24)19-23)18-17-40(29)34(45)28(20-22-10-13-26(36)14-11-22)39-32(43)27-15-16-31(42)38-27/h4-5,7-14,19,27-30H,3,6,15-18,20-21H2,1-2H3,(H,37,44)(H,38,42)(H,39,43)/t27?,28-,29+,30+/m1/s1
n/an/an/an/a 104n/an/an/an/a
Procter & Gamble Pharmaceuticals
Curated by ChEMBL
Assay Description
Agonist activity at human MC1R expressed in HEK293 cells assessed as effect on CRE-driven luminescence by luciferase reporter gene assay
J Med Chem 51: 6055-66 (2008)
Article DOI: 10.1021/jm800525p
BindingDB Entry DOI: 10.7270/Q2DV1JQC
Melanocortin receptor 3
(Homo sapiens (Human))
BDBM50253736
(CHEMBL506272 | N-((R)-3-(4-Fluorophenyl)-1-((S)-4-...)
Show SMILES CCC[C@@H]1N(CCN([C@@H](Cc2ccc3ccccc3c2)C(=O)NC)C1=O)C(=O)[C@@H](Cc1ccc(F)cc1)NC(=O)C1CCC(=O)N1 |r|
Show InChI InChI=1S/C35H40FN5O5/c1-3-6-29-35(46)41(30(33(44)37-2)21-23-9-12-24-7-4-5-8-25(24)19-23)18-17-40(29)34(45)28(20-22-10-13-26(36)14-11-22)39-32(43)27-15-16-31(42)38-27/h4-5,7-14,19,27-30H,3,6,15-18,20-21H2,1-2H3,(H,37,44)(H,38,42)(H,39,43)/t27?,28-,29+,30+/m1/s1
n/an/an/an/a 25n/an/an/an/a
Procter & Gamble Pharmaceuticals
Curated by ChEMBL
Assay Description
Agonist activity at human MC3R expressed in HEK293 cells assessed as effect on CRE-driven luminescence by luciferase reporter gene assay
J Med Chem 51: 6055-66 (2008)
Article DOI: 10.1021/jm800525p
BindingDB Entry DOI: 10.7270/Q2DV1JQC