BDBM50253772 (1H-Benzoimidazol-2-yl)-{4-[(5H-imidazol-1-yl)-phenyl-methyl]-phenyl}-amine::CHEMBL462468
SMILES: N(c1nc2ccccc2[nH]1)c1ccc(cc1)C(c1ccccc1)n1ccnc1
InChI Key: InChIKey=ZZMMQVBQBSLCLI-UHFFFAOYSA-N
Data: 1 IC50
Activity Spreadsheet -- Enzyme Inhibition Constant Data from BindingDB
Found 1 hit for monomerid = 50253772
Trg + Lig
Ki
nM
ΔG°
kcal/mole
IC50
nM
Kd
nM
EC50/IC50
nM
koff
s-1
kon
M-1s-1
pHTemp
°C
Cytochrome CYP26A1
(Homo sapiens (Human))
BDBM50253772
((1H-Benzoimidazol-2-yl)-{4-[(5H-imidazol-1-yl)-phe...)
Show SMILES N(c1nc2ccccc2[nH]1)c1ccc(cc1)C(c1ccccc1)n1ccnc1
Show InChI InChI=1S/C23H19N5/c1-2-6-17(7-3-1)22(28-15-14-24-16-28)18-10-12-19(13-11-18)25-23-26-20-8-4-5-9-21(20)27-23/h1-16,22H,(H2,25,26,27)
Reactome pathway
n/an/a 2.50E+3n/an/an/an/an/an/a
Cardiff University
Curated by ChEMBL
Assay Description
Inhibition of CYP26A1 in human MCF7 cells
Bioorg Med Chem 16: 8301-13 (2008)
Article DOI: 10.1016/j.bmc.2007.06.048
BindingDB Entry DOI: 10.7270/Q2M61M5B